{"text_format":"3","workbook":"xlsx","n_sheets":5,"sheets":["Shifts","Planning_CallCenter","Heures_Shifts","Couverture","Synthèse_Impression"],"read":"whole","date_system":"1900"}

{"sheet":"Shifts","index":0,"n_rows":7,"n_cols":4,"rows_kept":7}
["Code","Début","Fin","Durée (h)"]
["M","08:00:00","16:00:00",{"$f":"IF(C2>=B2,(C2-B2)*24,(1-(B2-C2))*24)","v":0}]
["J","09:00:00","17:00:00",{"$f":"IF(C3>=B3,(C3-B3)*24,(1-(B3-C3))*24)","v":0}]
["S","12:00:00","20:00:00",{"$f":"IF(C4>=B4,(C4-B4)*24,(1-(B4-C4))*24)","v":0}]
["E","10:00:00","18:00:00",{"$f":"IF(C5>=B5,(C5-B5)*24,(1-(B5-C5))*24)","v":0}]
["N","20:00:00","04:00:00",{"$f":"IF(C6>=B6,(C6-B6)*24,(1-(B6-C6))*24)","v":0}]
["OFF",null,null,{"$f":"IF(C7>=B7,(C7-B7)*24,(1-(B7-C7))*24)","v":0}]

{"sheet":"Planning_CallCenter","index":1,"n_rows":23,"n_cols":11,"rows_kept":23}
["Planning hebdomadaire — Call Center (shifts + couverture + synthèse)"]
[]
["Semaine débutant le","2025-10-27"]
["Saisir les codes de shifts (liste) par jour et agent ; heures hebdo et couverture se calculent."]
[]
[]
["ID","Agent","Rôle","Lun","Mar","Mer","Jeu","Ven","Sam","Dim","Heures hebdo"]
[1,"Amine L.","Conseiller","M","M","J","J","S","OFF","OFF",{"$f":"IFERROR(VLOOKUP(D8,Shifts!$A$2:$D$10,4,FALSE),0)+IFERROR(VLOOKUP(E8,Shifts!$A$2:$D$10,4,FALSE),0)+IFERROR(VLOOKUP(F8,Shifts!$A$2:$D$10,4,FALSE),0)+IFERROR(VLOOKUP(G8,Shifts!$A$2:$D$10,4,FALSE),0)+IFERROR(VLOOKUP(H8,Shifts!$A$2:$D$10,4,FALSE),0)+IFERROR(VLOOKUP(I8,Shifts!$A$2:$D$10,4,FALSE),0)+IFERROR(VLOOKUP(J8,Shifts!$A$2:$D$10,4,FALSE),0)","v":0}]
[2,"Sophie D.","Conseillère","J","J","S","S","M","OFF","OFF",{"$f":"IFERROR(VLOOKUP(D9,Shifts!$A$2:$D$10,4,FALSE),0)+IFERROR(VLOOKUP(E9,Shifts!$A$2:$D$10,4,FALSE),0)+IFERROR(VLOOKUP(F9,Shifts!$A$2:$D$10,4,FALSE),0)+IFERROR(VLOOKUP(G9,Shifts!$A$2:$D$10,4,FALSE),0)+IFERROR(VLOOKUP(H9,Shifts!$A$2:$D$10,4,FALSE),0)+IFERROR(VLOOKUP(I9,Shifts!$A$2:$D$10,4,FALSE),0)+IFERROR(VLOOKUP(J9,Shifts!$A$2:$D$10,4,FALSE),0)","v":0}]
[3,"Karim B.","Conseiller","E","E","M","M","J","OFF","OFF",{"$f":"IFERROR(VLOOKUP(D10,Shifts!$A$2:$D$10,4,FALSE),0)+IFERROR(VLOOKUP(E10,Shifts!$A$2:$D$10,4,FALSE),0)+IFERROR(VLOOKUP(F10,Shifts!$A$2:$D$10,4,FALSE),0)+IFERROR(VLOOKUP(G10,Shifts!$A$2:$D$10,4,FALSE),0)+IFERROR(VLOOKUP(H10,Shifts!$A$2:$D$10,4,FALSE),0)+IFERROR(VLOOKUP(I10,Shifts!$A$2:$D$10,4,FALSE),0)+IFERROR(VLOOKUP(J10,Shifts!$A$2:$D$10,4,FALSE),0)","v":0}]
{"$rows_left_out":14}
{"sheet":"Heures_Shifts","index":2,"n_rows":29,"n_cols":37,"rows_kept":29,"hidden":true}
["Helper: heures par agent issues des codes"]
[]
["Lun Débuts",{"$f":"IFERROR(VLOOKUP(Planning_CallCenter!D8,Shifts!$A$2:$C$10,2,FALSE),)","v":"00:00:00"},{"$f":"IFERROR(VLOOKUP(Planning_CallCenter!D9,Shifts!$A$2:$C$10,2,FALSE),)","v":"00:00:00"},{"$f":"IFERROR(VLOOKUP(Planning_CallCenter!D10,Shifts!$A$2:$C$10,2,FALSE),)","v":"00:00:00"},{"$f":"IFERROR(VLOOKUP(Planning_CallCenter!D11,Shifts!$A$2:$C$10,2,FALSE),)","v":"00:00:00"},{"$f":"IFERROR(VLOOKUP(Planning_CallCenter!D12,Shifts!$A$2:$C$10,2,FALSE),)","v":"00:00:00"},{"$f":"IFERROR(VLOOKUP(Planning_CallCenter!D13,Shifts!$A$2:$C$10,2,FALSE),)","v":"00:00:00"},{"$f":"IFERROR(VLOOKUP(Planning_CallCenter!D14,Shifts!$A$2:$C$10,2,FALSE),)","v":"00:00:00"},{"$f":"IFERROR(VLOOKUP(Planning_CallCenter!D15,Shifts!$A$2:$C$10,2,FALSE),)","v":"00:00:00"},{"$f":"IFERROR(VLOOKUP(Planning_CallCenter!D16,Shifts!$A$2:$C$10,2,FALSE),)","v":"00:00:00"},{"$f":"IFERROR(VLOOKUP(Planning_CallCenter!D17,Shifts!$A$2:$C$10,2,FALSE),)","v":"00:00:00"},{"$f":"IFERROR(VLOOKUP(Planning_CallCenter!D18,Shifts!$A$2:$C$10,2,FALSE),)","v":"00:00:00"},{"$f":"IFERROR(VLOOKUP(Planning_CallCenter!D19,Shifts!$A$2:$C$10,2,FALSE),)","v":"00:00:00"},{"$f":"IFERROR(VLOOKUP(Planning_CallCenter!D20,Shifts!$A$2:$C$10,2,FALSE),)","v":"00:00:00"},{"$f":"IFERROR(VLOOKUP(Planning_CallCenter!D21,Shifts!$A$2:$C$10,2,FALSE),)","v":"00:00:00"},{"$f":"IFERROR(VLOOKUP(Planning_CallCenter!D22,Shifts!$A$2:$C$10,2,FALSE),)","v":"00:00:00"},{"$f":"IFERROR(VLOOKUP(Planning_CallCenter!D23,Shifts!$A$2:$C$10,2,FALSE),)","v":"00:00:00"},{"$f":"IFERROR(VLOOKUP(Planning_CallCenter!D24,Shifts!$A$2:$C$10,2,FALSE),)","v":"00:00:00"},{"$f":"IFERROR(VLOOKUP(Planning_CallCenter!D25,Shifts!$A$2:$C$10,2,FALSE),)","v":"00:00:00"},{"$f":"IFERROR(VLOOKUP(Planning_CallCenter!D26,Shifts!$A$2:$C$10,2,FALSE),)","v":"00:00:00"},{"$f":"IFERROR(VLOOKUP(Planning_CallCenter!D27,Shifts!$A$2:$C$10,2,FALSE),)","v":"00:00:00"},{"$f":"IFERROR(VLOOKUP(Planning_CallCenter!D28,Shifts!$A$2:$C$10,2,FALSE),)","v":"00:00:00"},{"$f":"IFERROR(VLOOKUP(Planning_CallCenter!D29,Shifts!$A$2:$C$10,2,FALSE),)","v":"00:00:00"},{"$f":"IFERROR(VLOOKUP(Planning_CallCenter!D30,Shifts!$A$2:$C$10,2,FALSE),)","v":"00:00:00"},{"$f":"IFERROR(VLOOKUP(Planning_CallCenter!D31,Shifts!$A$2:$C$10,2,FALSE),)","v":"00:00:00"},{"$f":"IFERROR(VLOOKUP(Planning_CallCenter!D32,Shifts!$A$2:$C$10,2,FALSE),)","v":"00:00:00"},{"$f":"IFERROR(VLOOKUP(Planning_CallCenter!D33,Shifts!$A$2:$C$10,2,FALSE),)","v":"00:00:00"},{"$f":"IFERROR(VLOOKUP(Planning_CallCenter!D34,Shifts!$A$2:$C$10,2,FALSE),)","v":"00:00:00"},{"$f":"IFERROR(VLOOKUP(Planning_CallCenter!D35,Shifts!$A$2:$C$10,2,FALSE),)","v":"00:00:00"},{"$f":"IFERROR(VLOOKUP(Planning_CallCenter!D36,Shifts!$A$2:$C$10,2,FALSE),)","v":"00:00:00"},{"$f":"IFERROR(VLOOKUP(Planning_CallCenter!D37,Shifts!$A$2:$C$10,2,FALSE),)","v":"00:00:00"},{"$f":"IFERROR(VLOOKUP(Planning_CallCenter!D38,Shifts!$A$2:$C$10,2,FALSE),)","v":"00:00:00"},{"$f":"IFERROR(VLOOKUP(Planning_CallCenter!D39,Shifts!$A$2:$C$10,2,FALSE),)","v":"00:00:00"},{"$f":"IFERROR(VLOOKUP(Planning_CallCenter!D40,Shifts!$A$2:$C$10,2,FALSE),)","v":"00:00:00"},{"$f":"IFERROR(VLOOKUP(Planning_CallCenter!D41,Shifts!$A$2:$C$10,2,FALSE),)","v":"00:00:00"},{"$f":"IFERROR(VLOOKUP(Planning_CallCenter!D42,Shifts!$A$2:$C$10,2,FALSE),)","v":"00:00:00"},{"$f":"IFERROR(VLOOKUP(Planning_CallCenter!D43,Shifts!$A$2:$C$10,2,FALSE),)","v":"00:00:00"}]
["Lun Fins",{"$f":"IFERROR(VLOOKUP(Planning_CallCenter!D8,Shifts!$A$2:$C$10,3,FALSE),)","v":"00:00:00"},{"$f":"IFERROR(VLOOKUP(Planning_CallCenter!D9,Shifts!$A$2:$C$10,3,FALSE),)","v":"00:00:00"},{"$f":"IFERROR(VLOOKUP(Planning_CallCenter!D10,Shifts!$A$2:$C$10,3,FALSE),)","v":"00:00:00"},{"$f":"IFERROR(VLOOKUP(Planning_CallCenter!D11,Shifts!$A$2:$C$10,3,FALSE),)","v":"00:00:00"},{"$f":"IFERROR(VLOOKUP(Planning_CallCenter!D12,Shifts!$A$2:$C$10,3,FALSE),)","v":"00:00:00"},{"$f":"IFERROR(VLOOKUP(Planning_CallCenter!D13,Shifts!$A$2:$C$10,3,FALSE),)","v":"00:00:00"},{"$f":"IFERROR(VLOOKUP(Planning_CallCenter!D14,Shifts!$A$2:$C$10,3,FALSE),)","v":"00:00:00"},{"$f":"IFERROR(VLOOKUP(Planning_CallCenter!D15,Shifts!$A$2:$C$10,3,FALSE),)","v":"00:00:00"},{"$f":"IFERROR(VLOOKUP(Planning_CallCenter!D16,Shifts!$A$2:$C$10,3,FALSE),)","v":"00:00:00"},{"$f":"IFERROR(VLOOKUP(Planning_CallCenter!D17,Shifts!$A$2:$C$10,3,FALSE),)","v":"00:00:00"},{"$f":"IFERROR(VLOOKUP(Planning_CallCenter!D18,Shifts!$A$2:$C$10,3,FALSE),)","v":"00:00:00"},{"$f":"IFERROR(VLOOKUP(Planning_CallCenter!D19,Shifts!$A$2:$C$10,3,FALSE),)","v":"00:00:00"},{"$f":"IFERROR(VLOOKUP(Planning_CallCenter!D20,Shifts!$A$2:$C$10,3,FALSE),)","v":"00:00:00"},{"$f":"IFERROR(VLOOKUP(Planning_CallCenter!D21,Shifts!$A$2:$C$10,3,FALSE),)","v":"00:00:00"},{"$f":"IFERROR(VLOOKUP(Planning_CallCenter!D22,Shifts!$A$2:$C$10,3,FALSE),)","v":"00:00:00"},{"$f":"IFERROR(VLOOKUP(Planning_CallCenter!D23,Shifts!$A$2:$C$10,3,FALSE),)","v":"00:00:00"},{"$f":"IFERROR(VLOOKUP(Planning_CallCenter!D24,Shifts!$A$2:$C$10,3,FALSE),)","v":"00:00:00"},{"$f":"IFERROR(VLOOKUP(Planning_CallCenter!D25,Shifts!$A$2:$C$10,3,FALSE),)","v":"00:00:00"},{"$f":"IFERROR(VLOOKUP(Planning_CallCenter!D26,Shifts!$A$2:$C$10,3,FALSE),)","v":"00:00:00"},{"$f":"IFERROR(VLOOKUP(Planning_CallCenter!D27,Shifts!$A$2:$C$10,3,FALSE),)","v":"00:00:00"},{"$f":"IFERROR(VLOOKUP(Planning_CallCenter!D28,Shifts!$A$2:$C$10,3,FALSE),)","v":"00:00:00"},{"$f":"IFERROR(VLOOKUP(Planning_CallCenter!D29,Shifts!$A$2:$C$10,3,FALSE),)","v":"00:00:00"},{"$f":"IFERROR(VLOOKUP(Planning_CallCenter!D30,Shifts!$A$2:$C$10,3,FALSE),)","v":"00:00:00"},{"$f":"IFERROR(VLOOKUP(Planning_CallCenter!D31,Shifts!$A$2:$C$10,3,FALSE),)","v":"00:00:00"},{"$f":"IFERROR(VLOOKUP(Planning_CallCenter!D32,Shifts!$A$2:$C$10,3,FALSE),)","v":"00:00:00"},{"$f":"IFERROR(VLOOKUP(Planning_CallCenter!D33,Shifts!$A$2:$C$10,3,FALSE),)","v":"00:00:00"},{"$f":"IFERROR(VLOOKUP(Planning_CallCenter!D34,Shifts!$A$2:$C$10,3,FALSE),)","v":"00:00:00"},{"$f":"IFERROR(VLOOKUP(Planning_CallCenter!D35,Shifts!$A$2:$C$10,3,FALSE),)","v":"00:00:00"},{"$f":"IFERROR(VLOOKUP(Planning_CallCenter!D36,Shifts!$A$2:$C$10,3,FALSE),)","v":"00:00:00"},{"$f":"IFERROR(VLOOKUP(Planning_CallCenter!D37,Shifts!$A$2:$C$10,3,FALSE),)","v":"00:00:00"},{"$f":"IFERROR(VLOOKUP(Planning_CallCenter!D38,Shifts!$A$2:$C$10,3,FALSE),)","v":"00:00:00"},{"$f":"IFERROR(VLOOKUP(Planning_CallCenter!D39,Shifts!$A$2:$C$10,3,FALSE),)","v":"00:00:00"},{"$f":"IFERROR(VLOOKUP(Planning_CallCenter!D40,Shifts!$A$2:$C$10,3,FALSE),)","v":"00:00:00"},{"$f":"IFERROR(VLOOKUP(Planning_CallCenter!D41,Shifts!$A$2:$C$10,3,FALSE),)","v":"00:00:00"},{"$f":"IFERROR(VLOOKUP(Planning_CallCenter!D42,Shifts!$A$2:$C$10,3,FALSE),)","v":"00:00:00"},{"$f":"IFERROR(VLOOKUP(Planning_CallCenter!D43,Shifts!$A$2:$C$10,3,FALSE),)","v":"00:00:00"}]
["Lun Durée (h)",{"$f":"IF(B4>=B3,(B4-B3)*24,(1-(B3-B4))*24)","v":0},{"$f":"IF(C4>=C3,(C4-C3)*24,(1-(C3-C4))*24)","v":0},{"$f":"IF(D4>=D3,(D4-D3)*24,(1-(D3-D4))*24)","v":0},{"$f":"IF(E4>=E3,(E4-E3)*24,(1-(E3-E4))*24)","v":0},{"$f":"IF(F4>=F3,(F4-F3)*24,(1-(F3-F4))*24)","v":0},{"$f":"IF(G4>=G3,(G4-G3)*24,(1-(G3-G4))*24)","v":0},{"$f":"IF(H4>=H3,(H4-H3)*24,(1-(H3-H4))*24)","v":0},{"$f":"IF(I4>=I3,(I4-I3)*24,(1-(I3-I4))*24)","v":0},{"$f":"IF(J4>=J3,(J4-J3)*24,(1-(J3-J4))*24)","v":0},{"$f":"IF(K4>=K3,(K4-K3)*24,(1-(K3-K4))*24)","v":0},{"$f":"IF(L4>=L3,(L4-L3)*24,(1-(L3-L4))*24)","v":0},{"$f":"IF(M4>=M3,(M4-M3)*24,(1-(M3-M4))*24)","v":0},{"$f":"IF(N4>=N3,(N4-N3)*24,(1-(N3-N4))*24)","v":0},{"$f":"IF(O4>=O3,(O4-O3)*24,(1-(O3-O4))*24)","v":0},{"$f":"IF(P4>=P3,(P4-P3)*24,(1-(P3-P4))*24)","v":0},{"$f":"IF(Q4>=Q3,(Q4-Q3)*24,(1-(Q3-Q4))*24)","v":0},{"$f":"IF(R4>=R3,(R4-R3)*24,(1-(R3-R4))*24)","v":0},{"$f":"IF(S4>=S3,(S4-S3)*24,(1-(S3-S4))*24)","v":0},{"$f":"IF(T4>=T3,(T4-T3)*24,(1-(T3-T4))*24)","v":0},{"$f":"IF(U4>=U3,(U4-U3)*24,(1-(U3-U4))*24)","v":0},{"$f":"IF(V4>=V3,(V4-V3)*24,(1-(V3-V4))*24)","v":0},{"$f":"IF(W4>=W3,(W4-W3)*24,(1-(W3-W4))*24)","v":0},{"$f":"IF(X4>=X3,(X4-X3)*24,(1-(X3-X4))*24)","v":0},{"$f":"IF(Y4>=Y3,(Y4-Y3)*24,(1-(Y3-Y4))*24)","v":0},{"$f":"IF(Z4>=Z3,(Z4-Z3)*24,(1-(Z3-Z4))*24)","v":0},{"$f":"IF(AA4>=AA3,(AA4-AA3)*24,(1-(AA3-AA4))*24)","v":0},{"$f":"IF(AB4>=AB3,(AB4-AB3)*24,(1-(AB3-AB4))*24)","v":0},{"$f":"IF(AC4>=AC3,(AC4-AC3)*24,(1-(AC3-AC4))*24)","v":0},{"$f":"IF(AD4>=AD3,(AD4-AD3)*24,(1-(AD3-AD4))*24)","v":0},{"$f":"IF(AE4>=AE3,(AE4-AE3)*24,(1-(AE3-AE4))*24)","v":0},{"$f":"IF(AF4>=AF3,(AF4-AF3)*24,(1-(AF3-AF4))*24)","v":0},{"$f":"IF(AG4>=AG3,(AG4-AG3)*24,(1-(AG3-AG4))*24)","v":0},{"$f":"IF(AH4>=AH3,(AH4-AH3)*24,(1-(AH3-AH4))*24)","v":0},{"$f":"IF(AI4>=AI3,(AI4-AI3)*24,(1-(AI3-AI4))*24)","v":0},{"$f":"IF(AJ4>=AJ3,(AJ4-AJ3)*24,(1-(AJ3-AJ4))*24)","v":0},{"$f":"IF(AK4>=AK3,(AK4-AK3)*24,(1-(AK3-AK4))*24)","v":0}]
[]
["Mar Débuts",{"$f":"IFERROR(VLOOKUP(Planning_CallCenter!E8,Shifts!$A$2:$C$10,2,FALSE),)","v":"00:00:00"},{"$f":"IFERROR(VLOOKUP(Planning_CallCenter!E9,Shifts!$A$2:$C$10,2,FALSE),)","v":"00:00:00"},{"$f":"IFERROR(VLOOKUP(Planning_CallCenter!E10,Shifts!$A$2:$C$10,2,FALSE),)","v":"00:00:00"},{"$f":"IFERROR(VLOOKUP(Planning_CallCenter!E11,Shifts!$A$2:$C$10,2,FALSE),)","v":"00:00:00"},{"$f":"IFERROR(VLOOKUP(Planning_CallCenter!E12,Shifts!$A$2:$C$10,2,FALSE),)","v":"00:00:00"},{"$f":"IFERROR(VLOOKUP(Planning_CallCenter!E13,Shifts!$A$2:$C$10,2,FALSE),)","v":"00:00:00"},{"$f":"IFERROR(VLOOKUP(Planning_CallCenter!E14,Shifts!$A$2:$C$10,2,FALSE),)","v":"00:00:00"},{"$f":"IFERROR(VLOOKUP(Planning_CallCenter!E15,Shifts!$A$2:$C$10,2,FALSE),)","v":"00:00:00"},{"$f":"IFERROR(VLOOKUP(Planning_CallCenter!E16,Shifts!$A$2:$C$10,2,FALSE),)","v":"00:00:00"},{"$f":"IFERROR(VLOOKUP(Planning_CallCenter!E17,Shifts!$A$2:$C$10,2,FALSE),)","v":"00:00:00"},{"$f":"IFERROR(VLOOKUP(Planning_CallCenter!E18,Shifts!$A$2:$C$10,2,FALSE),)","v":"00:00:00"},{"$f":"IFERROR(VLOOKUP(Planning_CallCenter!E19,Shifts!$A$2:$C$10,2,FALSE),)","v":"00:00:00"},{"$f":"IFERROR(VLOOKUP(Planning_CallCenter!E20,Shifts!$A$2:$C$10,2,FALSE),)","v":"00:00:00"},{"$f":"IFERROR(VLOOKUP(Planning_CallCenter!E21,Shifts!$A$2:$C$10,2,FALSE),)","v":"00:00:00"},{"$f":"IFERROR(VLOOKUP(Planning_CallCenter!E22,Shifts!$A$2:$C$10,2,FALSE),)","v":"00:00:00"},{"$f":"IFERROR(VLOOKUP(Planning_CallCenter!E23,Shifts!$A$2:$C$10,2,FALSE),)","v":"00:00:00"},{"$f":"IFERROR(VLOOKUP(Planning_CallCenter!E24,Shifts!$A$2:$C$10,2,FALSE),)","v":"00:00:00"},{"$f":"IFERROR(VLOOKUP(Planning_CallCenter!E25,Shifts!$A$2:$C$10,2,FALSE),)","v":"00:00:00"},{"$f":"IFERROR(VLOOKUP(Planning_CallCenter!E26,Shifts!$A$2:$C$10,2,FALSE),)","v":"00:00:00"},{"$f":"IFERROR(VLOOKUP(Planning_CallCenter!E27,Shifts!$A$2:$C$10,2,FALSE),)","v":"00:00:00"},{"$f":"IFERROR(VLOOKUP(Planning_CallCenter!E28,Shifts!$A$2:$C$10,2,FALSE),)","v":"00:00:00"},{"$f":"IFERROR(VLOOKUP(Planning_CallCenter!E29,Shifts!$A$2:$C$10,2,FALSE),)","v":"00:00:00"},{"$f":"IFERROR(VLOOKUP(Planning_CallCenter!E30,Shifts!$A$2:$C$10,2,FALSE),)","v":"00:00:00"},{"$f":"IFERROR(VLOOKUP(Planning_CallCenter!E31,Shifts!$A$2:$C$10,2,FALSE),)","v":"00:00:00"},{"$f":"IFERROR(VLOOKUP(Planning_CallCenter!E32,Shifts!$A$2:$C$10,2,FALSE),)","v":"00:00:00"},{"$f":"IFERROR(VLOOKUP(Planning_CallCenter!E33,Shifts!$A$2:$C$10,2,FALSE),)","v":"00:00:00"},{"$f":"IFERROR(VLOOKUP(Planning_CallCenter!E34,Shifts!$A$2:$C$10,2,FALSE),)","v":"00:00:00"},{"$f":"IFERROR(VLOOKUP(Planning_CallCenter!E35,Shifts!$A$2:$C$10,2,FALSE),)","v":"00:00:00"},{"$f":"IFERROR(VLOOKUP(Planning_CallCenter!E36,Shifts!$A$2:$C$10,2,FALSE),)","v":"00:00:00"},{"$f":"IFERROR(VLOOKUP(Planning_CallCenter!E37,Shifts!$A$2:$C$10,2,FALSE),)","v":"00:00:00"},{"$f":"IFERROR(VLOOKUP(Planning_CallCenter!E38,Shifts!$A$2:$C$10,2,FALSE),)","v":"00:00:00"},{"$f":"IFERROR(VLOOKUP(Planning_CallCenter!E39,Shifts!$A$2:$C$10,2,FALSE),)","v":"00:00:00"},{"$f":"IFERROR(VLOOKUP(Planning_CallCenter!E40,Shifts!$A$2:$C$10,2,FALSE),)","v":"00:00:00"},{"$f":"IFERROR(VLOOKUP(Planning_CallCenter!E41,Shifts!$A$2:$C$10,2,FALSE),)","v":"00:00:00"},{"$f":"IFERROR(VLOOKUP(Planning_CallCenter!E42,Shifts!$A$2:$C$10,2,FALSE),)","v":"00:00:00"},{"$f":"IFERROR(VLOOKUP(Planning_CallCenter!E43,Shifts!$A$2:$C$10,2,FALSE),)","v":"00:00:00"}]
["Mar Fins",{"$f":"IFERROR(VLOOKUP(Planning_CallCenter!E8,Shifts!$A$2:$C$10,3,FALSE),)","v":"00:00:00"},{"$f":"IFERROR(VLOOKUP(Planning_CallCenter!E9,Shifts!$A$2:$C$10,3,FALSE),)","v":"00:00:00"},{"$f":"IFERROR(VLOOKUP(Planning_CallCenter!E10,Shifts!$A$2:$C$10,3,FALSE),)","v":"00:00:00"},{"$f":"IFERROR(VLOOKUP(Planning_CallCenter!E11,Shifts!$A$2:$C$10,3,FALSE),)","v":"00:00:00"},{"$f":"IFERROR(VLOOKUP(Planning_CallCenter!E12,Shifts!$A$2:$C$10,3,FALSE),)","v":"00:00:00"},{"$f":"IFERROR(VLOOKUP(Planning_CallCenter!E13,Shifts!$A$2:$C$10,3,FALSE),)","v":"00:00:00"},{"$f":"IFERROR(VLOOKUP(Planning_CallCenter!E14,Shifts!$A$2:$C$10,3,FALSE),)","v":"00:00:00"},{"$f":"IFERROR(VLOOKUP(Planning_CallCenter!E15,Shifts!$A$2:$C$10,3,FALSE),)","v":"00:00:00"},{"$f":"IFERROR(VLOOKUP(Planning_CallCenter!E16,Shifts!$A$2:$C$10,3,FALSE),)","v":"00:00:00"},{"$f":"IFERROR(VLOOKUP(Planning_CallCenter!E17,Shifts!$A$2:$C$10,3,FALSE),)","v":"00:00:00"},{"$f":"IFERROR(VLOOKUP(Planning_CallCenter!E18,Shifts!$A$2:$C$10,3,FALSE),)","v":"00:00:00"},{"$f":"IFERROR(VLOOKUP(Planning_CallCenter!E19,Shifts!$A$2:$C$10,3,FALSE),)","v":"00:00:00"},{"$f":"IFERROR(VLOOKUP(Planning_CallCenter!E20,Shifts!$A$2:$C$10,3,FALSE),)","v":"00:00:00"},{"$f":"IFERROR(VLOOKUP(Planning_CallCenter!E21,Shifts!$A$2:$C$10,3,FALSE),)","v":"00:00:00"},{"$f":"IFERROR(VLOOKUP(Planning_CallCenter!E22,Shifts!$A$2:$C$10,3,FALSE),)","v":"00:00:00"},{"$f":"IFERROR(VLOOKUP(Planning_CallCenter!E23,Shifts!$A$2:$C$10,3,FALSE),)","v":"00:00:00"},{"$f":"IFERROR(VLOOKUP(Planning_CallCenter!E24,Shifts!$A$2:$C$10,3,FALSE),)","v":"00:00:00"},{"$f":"IFERROR(VLOOKUP(Planning_CallCenter!E25,Shifts!$A$2:$C$10,3,FALSE),)","v":"00:00:00"},{"$f":"IFERROR(VLOOKUP(Planning_CallCenter!E26,Shifts!$A$2:$C$10,3,FALSE),)","v":"00:00:00"},{"$f":"IFERROR(VLOOKUP(Planning_CallCenter!E27,Shifts!$A$2:$C$10,3,FALSE),)","v":"00:00:00"},{"$f":"IFERROR(VLOOKUP(Planning_CallCenter!E28,Shifts!$A$2:$C$10,3,FALSE),)","v":"00:00:00"},{"$f":"IFERROR(VLOOKUP(Planning_CallCenter!E29,Shifts!$A$2:$C$10,3,FALSE),)","v":"00:00:00"},{"$f":"IFERROR(VLOOKUP(Planning_CallCenter!E30,Shifts!$A$2:$C$10,3,FALSE),)","v":"00:00:00"},{"$f":"IFERROR(VLOOKUP(Planning_CallCenter!E31,Shifts!$A$2:$C$10,3,FALSE),)","v":"00:00:00"},{"$f":"IFERROR(VLOOKUP(Planning_CallCenter!E32,Shifts!$A$2:$C$10,3,FALSE),)","v":"00:00:00"},{"$f":"IFERROR(VLOOKUP(Planning_CallCenter!E33,Shifts!$A$2:$C$10,3,FALSE),)","v":"00:00:00"},{"$f":"IFERROR(VLOOKUP(Planning_CallCenter!E34,Shifts!$A$2:$C$10,3,FALSE),)","v":"00:00:00"},{"$f":"IFERROR(VLOOKUP(Planning_CallCenter!E35,Shifts!$A$2:$C$10,3,FALSE),)","v":"00:00:00"},{"$f":"IFERROR(VLOOKUP(Planning_CallCenter!E36,Shifts!$A$2:$C$10,3,FALSE),)","v":"00:00:00"},{"$f":"IFERROR(VLOOKUP(Planning_CallCenter!E37,Shifts!$A$2:$C$10,3,FALSE),)","v":"00:00:00"},{"$f":"IFERROR(VLOOKUP(Planning_CallCenter!E38,Shifts!$A$2:$C$10,3,FALSE),)","v":"00:00:00"},{"$f":"IFERROR(VLOOKUP(Planning_CallCenter!E39,Shifts!$A$2:$C$10,3,FALSE),)","v":"00:00:00"},{"$f":"IFERROR(VLOOKUP(Planning_CallCenter!E40,Shifts!$A$2:$C$10,3,FALSE),)","v":"00:00:00"},{"$f":"IFERROR(VLOOKUP(Planning_CallCenter!E41,Shifts!$A$2:$C$10,3,FALSE),)","v":"00:00:00"},{"$f":"IFERROR(VLOOKUP(Planning_CallCenter!E42,Shifts!$A$2:$C$10,3,FALSE),)","v":"00:00:00"},{"$f":"IFERROR(VLOOKUP(Planning_CallCenter!E43,Shifts!$A$2:$C$10,3,FALSE),)","v":"00:00:00"}]
["Mar Durée (h)",{"$f":"IF(B8>=B7,(B8-B7)*24,(1-(B7-B8))*24)","v":0},{"$f":"IF(C8>=C7,(C8-C7)*24,(1-(C7-C8))*24)","v":0},{"$f":"IF(D8>=D7,(D8-D7)*24,(1-(D7-D8))*24)","v":0},{"$f":"IF(E8>=E7,(E8-E7)*24,(1-(E7-E8))*24)","v":0},{"$f":"IF(F8>=F7,(F8-F7)*24,(1-(F7-F8))*24)","v":0},{"$f":"IF(G8>=G7,(G8-G7)*24,(1-(G7-G8))*24)","v":0},{"$f":"IF(H8>=H7,(H8-H7)*24,(1-(H7-H8))*24)","v":0},{"$f":"IF(I8>=I7,(I8-I7)*24,(1-(I7-I8))*24)","v":0},{"$f":"IF(J8>=J7,(J8-J7)*24,(1-(J7-J8))*24)","v":0},{"$f":"IF(K8>=K7,(K8-K7)*24,(1-(K7-K8))*24)","v":0},{"$f":"IF(L8>=L7,(L8-L7)*24,(1-(L7-L8))*24)","v":0},{"$f":"IF(M8>=M7,(M8-M7)*24,(1-(M7-M8))*24)","v":0},{"$f":"IF(N8>=N7,(N8-N7)*24,(1-(N7-N8))*24)","v":0},{"$f":"IF(O8>=O7,(O8-O7)*24,(1-(O7-O8))*24)","v":0},{"$f":"IF(P8>=P7,(P8-P7)*24,(1-(P7-P8))*24)","v":0},{"$f":"IF(Q8>=Q7,(Q8-Q7)*24,(1-(Q7-Q8))*24)","v":0},{"$f":"IF(R8>=R7,(R8-R7)*24,(1-(R7-R8))*24)","v":0},{"$f":"IF(S8>=S7,(S8-S7)*24,(1-(S7-S8))*24)","v":0},{"$f":"IF(T8>=T7,(T8-T7)*24,(1-(T7-T8))*24)","v":0},{"$f":"IF(U8>=U7,(U8-U7)*24,(1-(U7-U8))*24)","v":0},{"$f":"IF(V8>=V7,(V8-V7)*24,(1-(V7-V8))*24)","v":0},{"$f":"IF(W8>=W7,(W8-W7)*24,(1-(W7-W8))*24)","v":0},{"$f":"IF(X8>=X7,(X8-X7)*24,(1-(X7-X8))*24)","v":0},{"$f":"IF(Y8>=Y7,(Y8-Y7)*24,(1-(Y7-Y8))*24)","v":0},{"$f":"IF(Z8>=Z7,(Z8-Z7)*24,(1-(Z7-Z8))*24)","v":0},{"$f":"IF(AA8>=AA7,(AA8-AA7)*24,(1-(AA7-AA8))*24)","v":0},{"$f":"IF(AB8>=AB7,(AB8-AB7)*24,(1-(AB7-AB8))*24)","v":0},{"$f":"IF(AC8>=AC7,(AC8-AC7)*24,(1-(AC7-AC8))*24)","v":0},{"$f":"IF(AD8>=AD7,(AD8-AD7)*24,(1-(AD7-AD8))*24)","v":0},{"$f":"IF(AE8>=AE7,(AE8-AE7)*24,(1-(AE7-AE8))*24)","v":0},{"$f":"IF(AF8>=AF7,(AF8-AF7)*24,(1-(AF7-AF8))*24)","v":0},{"$f":"IF(AG8>=AG7,(AG8-AG7)*24,(1-(AG7-AG8))*24)","v":0},{"$f":"IF(AH8>=AH7,(AH8-AH7)*24,(1-(AH7-AH8))*24)","v":0},{"$f":"IF(AI8>=AI7,(AI8-AI7)*24,(1-(AI7-AI8))*24)","v":0},{"$f":"IF(AJ8>=AJ7,(AJ8-AJ7)*24,(1-(AJ7-AJ8))*24)","v":0},{"$f":"IF(AK8>=AK7,(AK8-AK7)*24,(1-(AK7-AK8))*24)","v":0}]
[]
{"$rows_left_out":20}
{"sheet":"Couverture","index":3,"n_rows":129,"n_cols":5,"rows_kept":129}
["Couverture horaire vs besoin (07:00 → 22:00)"]
[]
["Renseigner 'Besoin' par heure. 'Planifié' suit les shifts ; 'Écart' met en évidence les manques."]
[]
["Lun","Heure","Besoin","Planifié","Écart"]
[null,"07:00:00",4,{"$f":"SUMPRODUCT(((Heures_Shifts!$B$3:$AK$3<=B6)*(Heures_Shifts!$B$4:$AK$4>B6))+((Heures_Shifts!$B$4:$AK$4<Heures_Shifts!$B$3:$AK$3)*((Heures_Shifts!$B$3:$AK$3<=B6)+(Heures_Shifts!$B$4:$AK$4>B6))))","v":0},{"$f":"D6-C6","v":0}]
[null,"08:00:00",4,{"$f":"SUMPRODUCT(((Heures_Shifts!$B$3:$AK$3<=B7)*(Heures_Shifts!$B$4:$AK$4>B7))+((Heures_Shifts!$B$4:$AK$4<Heures_Shifts!$B$3:$AK$3)*((Heures_Shifts!$B$3:$AK$3<=B7)+(Heures_Shifts!$B$4:$AK$4>B7))))","v":0},{"$f":"D7-C7","v":0}]
[null,"09:00:00",8,{"$f":"SUMPRODUCT(((Heures_Shifts!$B$3:$AK$3<=B8)*(Heures_Shifts!$B$4:$AK$4>B8))+((Heures_Shifts!$B$4:$AK$4<Heures_Shifts!$B$3:$AK$3)*((Heures_Shifts!$B$3:$AK$3<=B8)+(Heures_Shifts!$B$4:$AK$4>B8))))","v":0},{"$f":"D8-C8","v":0}]
[null,"10:00:00",8,{"$f":"SUMPRODUCT(((Heures_Shifts!$B$3:$AK$3<=B9)*(Heures_Shifts!$B$4:$AK$4>B9))+((Heures_Shifts!$B$4:$AK$4<Heures_Shifts!$B$3:$AK$3)*((Heures_Shifts!$B$3:$AK$3<=B9)+(Heures_Shifts!$B$4:$AK$4>B9))))","v":0},{"$f":"D9-C9","v":0}]
[null,"11:00:00",8,{"$f":"SUMPRODUCT(((Heures_Shifts!$B$3:$AK$3<=B10)*(Heures_Shifts!$B$4:$AK$4>B10))+((Heures_Shifts!$B$4:$AK$4<Heures_Shifts!$B$3:$AK$3)*((Heures_Shifts!$B$3:$AK$3<=B10)+(Heures_Shifts!$B$4:$AK$4>B10))))","v":0},{"$f":"D10-C10","v":0}]
{"$rows_left_out":120}
{"sheet":"Synthèse_Impression","index":4,"n_rows":34,"n_cols":4,"rows_kept":34}
["Synthèse hebdomadaire — Call Center"]
["Semaine du :",{"$f":"Planning_CallCenter!B3","v":"00:00:00"}]
[]
["Heures hebdo par agent"]
["Agent","Heures"]
["Amine L.",{"$f":"Planning_CallCenter!K8","v":0}]
["Sophie D.",{"$f":"Planning_CallCenter!K9","v":0}]
["Karim B.",{"$f":"Planning_CallCenter!K10","v":0}]
["Julie P.",{"$f":"Planning_CallCenter!K11","v":0}]
["Hassan R.",{"$f":"Planning_CallCenter!K12","v":0}]
{"$rows_left_out":24}