{"text_format":"3","workbook":"xlsx","n_sheets":4,"sheets":["Shifts","Planning_CallCenter","Heures_Shifts","Couverture"],"read":"whole","date_system":"1900"}

{"sheet":"Shifts","index":0,"n_rows":7,"n_cols":3,"rows_kept":7}
["Code","Début","Fin"]
["M","08:00:00","16:00:00"]
["J","09:00:00","17:00:00"]
["S","12:00:00","20:00:00"]
["E","10:00:00","18:00:00"]
["N","20:00:00","04:00:00"]
["OFF"]

{"sheet":"Planning_CallCenter","index":1,"n_rows":15,"n_cols":10,"rows_kept":15}
["Planning hebdomadaire — Call Center (shifts)"]
[]
["Saisir les codes de shifts (liste) par jour et agent. Couverture horaire calculée par jour."]
["Semaine débutant le","2025-10-27"]
[]
[]
["ID","Agent","Rôle","Lun","Mar","Mer","Jeu","Ven","Sam","Dim"]
[1,"Amine L.","Conseiller","M","M","J","J","S","OFF","OFF"]
[2,"Sophie D.","Conseillère","J","J","S","S","M","OFF","OFF"]
[3,"Karim B.","Conseiller","M","M","J","J","S","OFF","OFF"]
{"$rows_left_out":6}
{"sheet":"Heures_Shifts","index":2,"n_rows":22,"n_cols":41,"rows_kept":22,"hidden":true}
["Helper: start/end times per day from codes"]
[]
["Lun Débuts",{"$f":"IFERROR(VLOOKUP(Planning_CallCenter!D8,Shifts!$A$2:$C$10,2,FALSE),)","v":"00:00:00"},{"$f":"IFERROR(VLOOKUP(Planning_CallCenter!D9,Shifts!$A$2:$C$10,2,FALSE),)","v":"00:00:00"},{"$f":"IFERROR(VLOOKUP(Planning_CallCenter!D10,Shifts!$A$2:$C$10,2,FALSE),)","v":"00:00:00"},{"$f":"IFERROR(VLOOKUP(Planning_CallCenter!D11,Shifts!$A$2:$C$10,2,FALSE),)","v":"00:00:00"},{"$f":"IFERROR(VLOOKUP(Planning_CallCenter!D12,Shifts!$A$2:$C$10,2,FALSE),)","v":"00:00:00"},{"$f":"IFERROR(VLOOKUP(Planning_CallCenter!D13,Shifts!$A$2:$C$10,2,FALSE),)","v":"00:00:00"},{"$f":"IFERROR(VLOOKUP(Planning_CallCenter!D14,Shifts!$A$2:$C$10,2,FALSE),)","v":"00:00:00"},{"$f":"IFERROR(VLOOKUP(Planning_CallCenter!D15,Shifts!$A$2:$C$10,2,FALSE),)","v":"00:00:00"},{"$f":"IFERROR(VLOOKUP(Planning_CallCenter!D16,Shifts!$A$2:$C$10,2,FALSE),)","v":"00:00:00"},{"$f":"IFERROR(VLOOKUP(Planning_CallCenter!D17,Shifts!$A$2:$C$10,2,FALSE),)","v":"00:00:00"},{"$f":"IFERROR(VLOOKUP(Planning_CallCenter!D18,Shifts!$A$2:$C$10,2,FALSE),)","v":"00:00:00"},{"$f":"IFERROR(VLOOKUP(Planning_CallCenter!D19,Shifts!$A$2:$C$10,2,FALSE),)","v":"00:00:00"},{"$f":"IFERROR(VLOOKUP(Planning_CallCenter!D20,Shifts!$A$2:$C$10,2,FALSE),)","v":"00:00:00"},{"$f":"IFERROR(VLOOKUP(Planning_CallCenter!D21,Shifts!$A$2:$C$10,2,FALSE),)","v":"00:00:00"},{"$f":"IFERROR(VLOOKUP(Planning_CallCenter!D22,Shifts!$A$2:$C$10,2,FALSE),)","v":"00:00:00"},{"$f":"IFERROR(VLOOKUP(Planning_CallCenter!D23,Shifts!$A$2:$C$10,2,FALSE),)","v":"00:00:00"},{"$f":"IFERROR(VLOOKUP(Planning_CallCenter!D24,Shifts!$A$2:$C$10,2,FALSE),)","v":"00:00:00"},{"$f":"IFERROR(VLOOKUP(Planning_CallCenter!D25,Shifts!$A$2:$C$10,2,FALSE),)","v":"00:00:00"},{"$f":"IFERROR(VLOOKUP(Planning_CallCenter!D26,Shifts!$A$2:$C$10,2,FALSE),)","v":"00:00:00"},{"$f":"IFERROR(VLOOKUP(Planning_CallCenter!D27,Shifts!$A$2:$C$10,2,FALSE),)","v":"00:00:00"},{"$f":"IFERROR(VLOOKUP(Planning_CallCenter!D28,Shifts!$A$2:$C$10,2,FALSE),)","v":"00:00:00"},{"$f":"IFERROR(VLOOKUP(Planning_CallCenter!D29,Shifts!$A$2:$C$10,2,FALSE),)","v":"00:00:00"},{"$f":"IFERROR(VLOOKUP(Planning_CallCenter!D30,Shifts!$A$2:$C$10,2,FALSE),)","v":"00:00:00"},{"$f":"IFERROR(VLOOKUP(Planning_CallCenter!D31,Shifts!$A$2:$C$10,2,FALSE),)","v":"00:00:00"},{"$f":"IFERROR(VLOOKUP(Planning_CallCenter!D32,Shifts!$A$2:$C$10,2,FALSE),)","v":"00:00:00"},{"$f":"IFERROR(VLOOKUP(Planning_CallCenter!D33,Shifts!$A$2:$C$10,2,FALSE),)","v":"00:00:00"},{"$f":"IFERROR(VLOOKUP(Planning_CallCenter!D34,Shifts!$A$2:$C$10,2,FALSE),)","v":"00:00:00"},{"$f":"IFERROR(VLOOKUP(Planning_CallCenter!D35,Shifts!$A$2:$C$10,2,FALSE),)","v":"00:00:00"},{"$f":"IFERROR(VLOOKUP(Planning_CallCenter!D36,Shifts!$A$2:$C$10,2,FALSE),)","v":"00:00:00"},{"$f":"IFERROR(VLOOKUP(Planning_CallCenter!D37,Shifts!$A$2:$C$10,2,FALSE),)","v":"00:00:00"},{"$f":"IFERROR(VLOOKUP(Planning_CallCenter!D38,Shifts!$A$2:$C$10,2,FALSE),)","v":"00:00:00"},{"$f":"IFERROR(VLOOKUP(Planning_CallCenter!D39,Shifts!$A$2:$C$10,2,FALSE),)","v":"00:00:00"},{"$f":"IFERROR(VLOOKUP(Planning_CallCenter!D40,Shifts!$A$2:$C$10,2,FALSE),)","v":"00:00:00"},{"$f":"IFERROR(VLOOKUP(Planning_CallCenter!D41,Shifts!$A$2:$C$10,2,FALSE),)","v":"00:00:00"},{"$f":"IFERROR(VLOOKUP(Planning_CallCenter!D42,Shifts!$A$2:$C$10,2,FALSE),)","v":"00:00:00"},{"$f":"IFERROR(VLOOKUP(Planning_CallCenter!D43,Shifts!$A$2:$C$10,2,FALSE),)","v":"00:00:00"},{"$f":"IFERROR(VLOOKUP(Planning_CallCenter!D44,Shifts!$A$2:$C$10,2,FALSE),)","v":"00:00:00"},{"$f":"IFERROR(VLOOKUP(Planning_CallCenter!D45,Shifts!$A$2:$C$10,2,FALSE),)","v":"00:00:00"},{"$f":"IFERROR(VLOOKUP(Planning_CallCenter!D46,Shifts!$A$2:$C$10,2,FALSE),)","v":"00:00:00"},{"$f":"IFERROR(VLOOKUP(Planning_CallCenter!D47,Shifts!$A$2:$C$10,2,FALSE),)","v":"00:00:00"}]
["Lun Fins",{"$f":"IFERROR(VLOOKUP(Planning_CallCenter!D8,Shifts!$A$2:$C$10,3,FALSE),)","v":"00:00:00"},{"$f":"IFERROR(VLOOKUP(Planning_CallCenter!D9,Shifts!$A$2:$C$10,3,FALSE),)","v":"00:00:00"},{"$f":"IFERROR(VLOOKUP(Planning_CallCenter!D10,Shifts!$A$2:$C$10,3,FALSE),)","v":"00:00:00"},{"$f":"IFERROR(VLOOKUP(Planning_CallCenter!D11,Shifts!$A$2:$C$10,3,FALSE),)","v":"00:00:00"},{"$f":"IFERROR(VLOOKUP(Planning_CallCenter!D12,Shifts!$A$2:$C$10,3,FALSE),)","v":"00:00:00"},{"$f":"IFERROR(VLOOKUP(Planning_CallCenter!D13,Shifts!$A$2:$C$10,3,FALSE),)","v":"00:00:00"},{"$f":"IFERROR(VLOOKUP(Planning_CallCenter!D14,Shifts!$A$2:$C$10,3,FALSE),)","v":"00:00:00"},{"$f":"IFERROR(VLOOKUP(Planning_CallCenter!D15,Shifts!$A$2:$C$10,3,FALSE),)","v":"00:00:00"},{"$f":"IFERROR(VLOOKUP(Planning_CallCenter!D16,Shifts!$A$2:$C$10,3,FALSE),)","v":"00:00:00"},{"$f":"IFERROR(VLOOKUP(Planning_CallCenter!D17,Shifts!$A$2:$C$10,3,FALSE),)","v":"00:00:00"},{"$f":"IFERROR(VLOOKUP(Planning_CallCenter!D18,Shifts!$A$2:$C$10,3,FALSE),)","v":"00:00:00"},{"$f":"IFERROR(VLOOKUP(Planning_CallCenter!D19,Shifts!$A$2:$C$10,3,FALSE),)","v":"00:00:00"},{"$f":"IFERROR(VLOOKUP(Planning_CallCenter!D20,Shifts!$A$2:$C$10,3,FALSE),)","v":"00:00:00"},{"$f":"IFERROR(VLOOKUP(Planning_CallCenter!D21,Shifts!$A$2:$C$10,3,FALSE),)","v":"00:00:00"},{"$f":"IFERROR(VLOOKUP(Planning_CallCenter!D22,Shifts!$A$2:$C$10,3,FALSE),)","v":"00:00:00"},{"$f":"IFERROR(VLOOKUP(Planning_CallCenter!D23,Shifts!$A$2:$C$10,3,FALSE),)","v":"00:00:00"},{"$f":"IFERROR(VLOOKUP(Planning_CallCenter!D24,Shifts!$A$2:$C$10,3,FALSE),)","v":"00:00:00"},{"$f":"IFERROR(VLOOKUP(Planning_CallCenter!D25,Shifts!$A$2:$C$10,3,FALSE),)","v":"00:00:00"},{"$f":"IFERROR(VLOOKUP(Planning_CallCenter!D26,Shifts!$A$2:$C$10,3,FALSE),)","v":"00:00:00"},{"$f":"IFERROR(VLOOKUP(Planning_CallCenter!D27,Shifts!$A$2:$C$10,3,FALSE),)","v":"00:00:00"},{"$f":"IFERROR(VLOOKUP(Planning_CallCenter!D28,Shifts!$A$2:$C$10,3,FALSE),)","v":"00:00:00"},{"$f":"IFERROR(VLOOKUP(Planning_CallCenter!D29,Shifts!$A$2:$C$10,3,FALSE),)","v":"00:00:00"},{"$f":"IFERROR(VLOOKUP(Planning_CallCenter!D30,Shifts!$A$2:$C$10,3,FALSE),)","v":"00:00:00"},{"$f":"IFERROR(VLOOKUP(Planning_CallCenter!D31,Shifts!$A$2:$C$10,3,FALSE),)","v":"00:00:00"},{"$f":"IFERROR(VLOOKUP(Planning_CallCenter!D32,Shifts!$A$2:$C$10,3,FALSE),)","v":"00:00:00"},{"$f":"IFERROR(VLOOKUP(Planning_CallCenter!D33,Shifts!$A$2:$C$10,3,FALSE),)","v":"00:00:00"},{"$f":"IFERROR(VLOOKUP(Planning_CallCenter!D34,Shifts!$A$2:$C$10,3,FALSE),)","v":"00:00:00"},{"$f":"IFERROR(VLOOKUP(Planning_CallCenter!D35,Shifts!$A$2:$C$10,3,FALSE),)","v":"00:00:00"},{"$f":"IFERROR(VLOOKUP(Planning_CallCenter!D36,Shifts!$A$2:$C$10,3,FALSE),)","v":"00:00:00"},{"$f":"IFERROR(VLOOKUP(Planning_CallCenter!D37,Shifts!$A$2:$C$10,3,FALSE),)","v":"00:00:00"},{"$f":"IFERROR(VLOOKUP(Planning_CallCenter!D38,Shifts!$A$2:$C$10,3,FALSE),)","v":"00:00:00"},{"$f":"IFERROR(VLOOKUP(Planning_CallCenter!D39,Shifts!$A$2:$C$10,3,FALSE),)","v":"00:00:00"},{"$f":"IFERROR(VLOOKUP(Planning_CallCenter!D40,Shifts!$A$2:$C$10,3,FALSE),)","v":"00:00:00"},{"$f":"IFERROR(VLOOKUP(Planning_CallCenter!D41,Shifts!$A$2:$C$10,3,FALSE),)","v":"00:00:00"},{"$f":"IFERROR(VLOOKUP(Planning_CallCenter!D42,Shifts!$A$2:$C$10,3,FALSE),)","v":"00:00:00"},{"$f":"IFERROR(VLOOKUP(Planning_CallCenter!D43,Shifts!$A$2:$C$10,3,FALSE),)","v":"00:00:00"},{"$f":"IFERROR(VLOOKUP(Planning_CallCenter!D44,Shifts!$A$2:$C$10,3,FALSE),)","v":"00:00:00"},{"$f":"IFERROR(VLOOKUP(Planning_CallCenter!D45,Shifts!$A$2:$C$10,3,FALSE),)","v":"00:00:00"},{"$f":"IFERROR(VLOOKUP(Planning_CallCenter!D46,Shifts!$A$2:$C$10,3,FALSE),)","v":"00:00:00"},{"$f":"IFERROR(VLOOKUP(Planning_CallCenter!D47,Shifts!$A$2:$C$10,3,FALSE),)","v":"00:00:00"}]
[]
["Mar Débuts",{"$f":"IFERROR(VLOOKUP(Planning_CallCenter!E8,Shifts!$A$2:$C$10,2,FALSE),)","v":"00:00:00"},{"$f":"IFERROR(VLOOKUP(Planning_CallCenter!E9,Shifts!$A$2:$C$10,2,FALSE),)","v":"00:00:00"},{"$f":"IFERROR(VLOOKUP(Planning_CallCenter!E10,Shifts!$A$2:$C$10,2,FALSE),)","v":"00:00:00"},{"$f":"IFERROR(VLOOKUP(Planning_CallCenter!E11,Shifts!$A$2:$C$10,2,FALSE),)","v":"00:00:00"},{"$f":"IFERROR(VLOOKUP(Planning_CallCenter!E12,Shifts!$A$2:$C$10,2,FALSE),)","v":"00:00:00"},{"$f":"IFERROR(VLOOKUP(Planning_CallCenter!E13,Shifts!$A$2:$C$10,2,FALSE),)","v":"00:00:00"},{"$f":"IFERROR(VLOOKUP(Planning_CallCenter!E14,Shifts!$A$2:$C$10,2,FALSE),)","v":"00:00:00"},{"$f":"IFERROR(VLOOKUP(Planning_CallCenter!E15,Shifts!$A$2:$C$10,2,FALSE),)","v":"00:00:00"},{"$f":"IFERROR(VLOOKUP(Planning_CallCenter!E16,Shifts!$A$2:$C$10,2,FALSE),)","v":"00:00:00"},{"$f":"IFERROR(VLOOKUP(Planning_CallCenter!E17,Shifts!$A$2:$C$10,2,FALSE),)","v":"00:00:00"},{"$f":"IFERROR(VLOOKUP(Planning_CallCenter!E18,Shifts!$A$2:$C$10,2,FALSE),)","v":"00:00:00"},{"$f":"IFERROR(VLOOKUP(Planning_CallCenter!E19,Shifts!$A$2:$C$10,2,FALSE),)","v":"00:00:00"},{"$f":"IFERROR(VLOOKUP(Planning_CallCenter!E20,Shifts!$A$2:$C$10,2,FALSE),)","v":"00:00:00"},{"$f":"IFERROR(VLOOKUP(Planning_CallCenter!E21,Shifts!$A$2:$C$10,2,FALSE),)","v":"00:00:00"},{"$f":"IFERROR(VLOOKUP(Planning_CallCenter!E22,Shifts!$A$2:$C$10,2,FALSE),)","v":"00:00:00"},{"$f":"IFERROR(VLOOKUP(Planning_CallCenter!E23,Shifts!$A$2:$C$10,2,FALSE),)","v":"00:00:00"},{"$f":"IFERROR(VLOOKUP(Planning_CallCenter!E24,Shifts!$A$2:$C$10,2,FALSE),)","v":"00:00:00"},{"$f":"IFERROR(VLOOKUP(Planning_CallCenter!E25,Shifts!$A$2:$C$10,2,FALSE),)","v":"00:00:00"},{"$f":"IFERROR(VLOOKUP(Planning_CallCenter!E26,Shifts!$A$2:$C$10,2,FALSE),)","v":"00:00:00"},{"$f":"IFERROR(VLOOKUP(Planning_CallCenter!E27,Shifts!$A$2:$C$10,2,FALSE),)","v":"00:00:00"},{"$f":"IFERROR(VLOOKUP(Planning_CallCenter!E28,Shifts!$A$2:$C$10,2,FALSE),)","v":"00:00:00"},{"$f":"IFERROR(VLOOKUP(Planning_CallCenter!E29,Shifts!$A$2:$C$10,2,FALSE),)","v":"00:00:00"},{"$f":"IFERROR(VLOOKUP(Planning_CallCenter!E30,Shifts!$A$2:$C$10,2,FALSE),)","v":"00:00:00"},{"$f":"IFERROR(VLOOKUP(Planning_CallCenter!E31,Shifts!$A$2:$C$10,2,FALSE),)","v":"00:00:00"},{"$f":"IFERROR(VLOOKUP(Planning_CallCenter!E32,Shifts!$A$2:$C$10,2,FALSE),)","v":"00:00:00"},{"$f":"IFERROR(VLOOKUP(Planning_CallCenter!E33,Shifts!$A$2:$C$10,2,FALSE),)","v":"00:00:00"},{"$f":"IFERROR(VLOOKUP(Planning_CallCenter!E34,Shifts!$A$2:$C$10,2,FALSE),)","v":"00:00:00"},{"$f":"IFERROR(VLOOKUP(Planning_CallCenter!E35,Shifts!$A$2:$C$10,2,FALSE),)","v":"00:00:00"},{"$f":"IFERROR(VLOOKUP(Planning_CallCenter!E36,Shifts!$A$2:$C$10,2,FALSE),)","v":"00:00:00"},{"$f":"IFERROR(VLOOKUP(Planning_CallCenter!E37,Shifts!$A$2:$C$10,2,FALSE),)","v":"00:00:00"},{"$f":"IFERROR(VLOOKUP(Planning_CallCenter!E38,Shifts!$A$2:$C$10,2,FALSE),)","v":"00:00:00"},{"$f":"IFERROR(VLOOKUP(Planning_CallCenter!E39,Shifts!$A$2:$C$10,2,FALSE),)","v":"00:00:00"},{"$f":"IFERROR(VLOOKUP(Planning_CallCenter!E40,Shifts!$A$2:$C$10,2,FALSE),)","v":"00:00:00"},{"$f":"IFERROR(VLOOKUP(Planning_CallCenter!E41,Shifts!$A$2:$C$10,2,FALSE),)","v":"00:00:00"},{"$f":"IFERROR(VLOOKUP(Planning_CallCenter!E42,Shifts!$A$2:$C$10,2,FALSE),)","v":"00:00:00"},{"$f":"IFERROR(VLOOKUP(Planning_CallCenter!E43,Shifts!$A$2:$C$10,2,FALSE),)","v":"00:00:00"},{"$f":"IFERROR(VLOOKUP(Planning_CallCenter!E44,Shifts!$A$2:$C$10,2,FALSE),)","v":"00:00:00"},{"$f":"IFERROR(VLOOKUP(Planning_CallCenter!E45,Shifts!$A$2:$C$10,2,FALSE),)","v":"00:00:00"},{"$f":"IFERROR(VLOOKUP(Planning_CallCenter!E46,Shifts!$A$2:$C$10,2,FALSE),)","v":"00:00:00"},{"$f":"IFERROR(VLOOKUP(Planning_CallCenter!E47,Shifts!$A$2:$C$10,2,FALSE),)","v":"00:00:00"}]
["Mar Fins",{"$f":"IFERROR(VLOOKUP(Planning_CallCenter!E8,Shifts!$A$2:$C$10,3,FALSE),)","v":"00:00:00"},{"$f":"IFERROR(VLOOKUP(Planning_CallCenter!E9,Shifts!$A$2:$C$10,3,FALSE),)","v":"00:00:00"},{"$f":"IFERROR(VLOOKUP(Planning_CallCenter!E10,Shifts!$A$2:$C$10,3,FALSE),)","v":"00:00:00"},{"$f":"IFERROR(VLOOKUP(Planning_CallCenter!E11,Shifts!$A$2:$C$10,3,FALSE),)","v":"00:00:00"},{"$f":"IFERROR(VLOOKUP(Planning_CallCenter!E12,Shifts!$A$2:$C$10,3,FALSE),)","v":"00:00:00"},{"$f":"IFERROR(VLOOKUP(Planning_CallCenter!E13,Shifts!$A$2:$C$10,3,FALSE),)","v":"00:00:00"},{"$f":"IFERROR(VLOOKUP(Planning_CallCenter!E14,Shifts!$A$2:$C$10,3,FALSE),)","v":"00:00:00"},{"$f":"IFERROR(VLOOKUP(Planning_CallCenter!E15,Shifts!$A$2:$C$10,3,FALSE),)","v":"00:00:00"},{"$f":"IFERROR(VLOOKUP(Planning_CallCenter!E16,Shifts!$A$2:$C$10,3,FALSE),)","v":"00:00:00"},{"$f":"IFERROR(VLOOKUP(Planning_CallCenter!E17,Shifts!$A$2:$C$10,3,FALSE),)","v":"00:00:00"},{"$f":"IFERROR(VLOOKUP(Planning_CallCenter!E18,Shifts!$A$2:$C$10,3,FALSE),)","v":"00:00:00"},{"$f":"IFERROR(VLOOKUP(Planning_CallCenter!E19,Shifts!$A$2:$C$10,3,FALSE),)","v":"00:00:00"},{"$f":"IFERROR(VLOOKUP(Planning_CallCenter!E20,Shifts!$A$2:$C$10,3,FALSE),)","v":"00:00:00"},{"$f":"IFERROR(VLOOKUP(Planning_CallCenter!E21,Shifts!$A$2:$C$10,3,FALSE),)","v":"00:00:00"},{"$f":"IFERROR(VLOOKUP(Planning_CallCenter!E22,Shifts!$A$2:$C$10,3,FALSE),)","v":"00:00:00"},{"$f":"IFERROR(VLOOKUP(Planning_CallCenter!E23,Shifts!$A$2:$C$10,3,FALSE),)","v":"00:00:00"},{"$f":"IFERROR(VLOOKUP(Planning_CallCenter!E24,Shifts!$A$2:$C$10,3,FALSE),)","v":"00:00:00"},{"$f":"IFERROR(VLOOKUP(Planning_CallCenter!E25,Shifts!$A$2:$C$10,3,FALSE),)","v":"00:00:00"},{"$f":"IFERROR(VLOOKUP(Planning_CallCenter!E26,Shifts!$A$2:$C$10,3,FALSE),)","v":"00:00:00"},{"$f":"IFERROR(VLOOKUP(Planning_CallCenter!E27,Shifts!$A$2:$C$10,3,FALSE),)","v":"00:00:00"},{"$f":"IFERROR(VLOOKUP(Planning_CallCenter!E28,Shifts!$A$2:$C$10,3,FALSE),)","v":"00:00:00"},{"$f":"IFERROR(VLOOKUP(Planning_CallCenter!E29,Shifts!$A$2:$C$10,3,FALSE),)","v":"00:00:00"},{"$f":"IFERROR(VLOOKUP(Planning_CallCenter!E30,Shifts!$A$2:$C$10,3,FALSE),)","v":"00:00:00"},{"$f":"IFERROR(VLOOKUP(Planning_CallCenter!E31,Shifts!$A$2:$C$10,3,FALSE),)","v":"00:00:00"},{"$f":"IFERROR(VLOOKUP(Planning_CallCenter!E32,Shifts!$A$2:$C$10,3,FALSE),)","v":"00:00:00"},{"$f":"IFERROR(VLOOKUP(Planning_CallCenter!E33,Shifts!$A$2:$C$10,3,FALSE),)","v":"00:00:00"},{"$f":"IFERROR(VLOOKUP(Planning_CallCenter!E34,Shifts!$A$2:$C$10,3,FALSE),)","v":"00:00:00"},{"$f":"IFERROR(VLOOKUP(Planning_CallCenter!E35,Shifts!$A$2:$C$10,3,FALSE),)","v":"00:00:00"},{"$f":"IFERROR(VLOOKUP(Planning_CallCenter!E36,Shifts!$A$2:$C$10,3,FALSE),)","v":"00:00:00"},{"$f":"IFERROR(VLOOKUP(Planning_CallCenter!E37,Shifts!$A$2:$C$10,3,FALSE),)","v":"00:00:00"},{"$f":"IFERROR(VLOOKUP(Planning_CallCenter!E38,Shifts!$A$2:$C$10,3,FALSE),)","v":"00:00:00"},{"$f":"IFERROR(VLOOKUP(Planning_CallCenter!E39,Shifts!$A$2:$C$10,3,FALSE),)","v":"00:00:00"},{"$f":"IFERROR(VLOOKUP(Planning_CallCenter!E40,Shifts!$A$2:$C$10,3,FALSE),)","v":"00:00:00"},{"$f":"IFERROR(VLOOKUP(Planning_CallCenter!E41,Shifts!$A$2:$C$10,3,FALSE),)","v":"00:00:00"},{"$f":"IFERROR(VLOOKUP(Planning_CallCenter!E42,Shifts!$A$2:$C$10,3,FALSE),)","v":"00:00:00"},{"$f":"IFERROR(VLOOKUP(Planning_CallCenter!E43,Shifts!$A$2:$C$10,3,FALSE),)","v":"00:00:00"},{"$f":"IFERROR(VLOOKUP(Planning_CallCenter!E44,Shifts!$A$2:$C$10,3,FALSE),)","v":"00:00:00"},{"$f":"IFERROR(VLOOKUP(Planning_CallCenter!E45,Shifts!$A$2:$C$10,3,FALSE),)","v":"00:00:00"},{"$f":"IFERROR(VLOOKUP(Planning_CallCenter!E46,Shifts!$A$2:$C$10,3,FALSE),)","v":"00:00:00"},{"$f":"IFERROR(VLOOKUP(Planning_CallCenter!E47,Shifts!$A$2:$C$10,3,FALSE),)","v":"00:00:00"}]
[]
["Mer Débuts",{"$f":"IFERROR(VLOOKUP(Planning_CallCenter!F8,Shifts!$A$2:$C$10,2,FALSE),)","v":"00:00:00"},{"$f":"IFERROR(VLOOKUP(Planning_CallCenter!F9,Shifts!$A$2:$C$10,2,FALSE),)","v":"00:00:00"},{"$f":"IFERROR(VLOOKUP(Planning_CallCenter!F10,Shifts!$A$2:$C$10,2,FALSE),)","v":"00:00:00"},{"$f":"IFERROR(VLOOKUP(Planning_CallCenter!F11,Shifts!$A$2:$C$10,2,FALSE),)","v":"00:00:00"},{"$f":"IFERROR(VLOOKUP(Planning_CallCenter!F12,Shifts!$A$2:$C$10,2,FALSE),)","v":"00:00:00"},{"$f":"IFERROR(VLOOKUP(Planning_CallCenter!F13,Shifts!$A$2:$C$10,2,FALSE),)","v":"00:00:00"},{"$f":"IFERROR(VLOOKUP(Planning_CallCenter!F14,Shifts!$A$2:$C$10,2,FALSE),)","v":"00:00:00"},{"$f":"IFERROR(VLOOKUP(Planning_CallCenter!F15,Shifts!$A$2:$C$10,2,FALSE),)","v":"00:00:00"},{"$f":"IFERROR(VLOOKUP(Planning_CallCenter!F16,Shifts!$A$2:$C$10,2,FALSE),)","v":"00:00:00"},{"$f":"IFERROR(VLOOKUP(Planning_CallCenter!F17,Shifts!$A$2:$C$10,2,FALSE),)","v":"00:00:00"},{"$f":"IFERROR(VLOOKUP(Planning_CallCenter!F18,Shifts!$A$2:$C$10,2,FALSE),)","v":"00:00:00"},{"$f":"IFERROR(VLOOKUP(Planning_CallCenter!F19,Shifts!$A$2:$C$10,2,FALSE),)","v":"00:00:00"},{"$f":"IFERROR(VLOOKUP(Planning_CallCenter!F20,Shifts!$A$2:$C$10,2,FALSE),)","v":"00:00:00"},{"$f":"IFERROR(VLOOKUP(Planning_CallCenter!F21,Shifts!$A$2:$C$10,2,FALSE),)","v":"00:00:00"},{"$f":"IFERROR(VLOOKUP(Planning_CallCenter!F22,Shifts!$A$2:$C$10,2,FALSE),)","v":"00:00:00"},{"$f":"IFERROR(VLOOKUP(Planning_CallCenter!F23,Shifts!$A$2:$C$10,2,FALSE),)","v":"00:00:00"},{"$f":"IFERROR(VLOOKUP(Planning_CallCenter!F24,Shifts!$A$2:$C$10,2,FALSE),)","v":"00:00:00"},{"$f":"IFERROR(VLOOKUP(Planning_CallCenter!F25,Shifts!$A$2:$C$10,2,FALSE),)","v":"00:00:00"},{"$f":"IFERROR(VLOOKUP(Planning_CallCenter!F26,Shifts!$A$2:$C$10,2,FALSE),)","v":"00:00:00"},{"$f":"IFERROR(VLOOKUP(Planning_CallCenter!F27,Shifts!$A$2:$C$10,2,FALSE),)","v":"00:00:00"},{"$f":"IFERROR(VLOOKUP(Planning_CallCenter!F28,Shifts!$A$2:$C$10,2,FALSE),)","v":"00:00:00"},{"$f":"IFERROR(VLOOKUP(Planning_CallCenter!F29,Shifts!$A$2:$C$10,2,FALSE),)","v":"00:00:00"},{"$f":"IFERROR(VLOOKUP(Planning_CallCenter!F30,Shifts!$A$2:$C$10,2,FALSE),)","v":"00:00:00"},{"$f":"IFERROR(VLOOKUP(Planning_CallCenter!F31,Shifts!$A$2:$C$10,2,FALSE),)","v":"00:00:00"},{"$f":"IFERROR(VLOOKUP(Planning_CallCenter!F32,Shifts!$A$2:$C$10,2,FALSE),)","v":"00:00:00"},{"$f":"IFERROR(VLOOKUP(Planning_CallCenter!F33,Shifts!$A$2:$C$10,2,FALSE),)","v":"00:00:00"},{"$f":"IFERROR(VLOOKUP(Planning_CallCenter!F34,Shifts!$A$2:$C$10,2,FALSE),)","v":"00:00:00"},{"$f":"IFERROR(VLOOKUP(Planning_CallCenter!F35,Shifts!$A$2:$C$10,2,FALSE),)","v":"00:00:00"},{"$f":"IFERROR(VLOOKUP(Planning_CallCenter!F36,Shifts!$A$2:$C$10,2,FALSE),)","v":"00:00:00"},{"$f":"IFERROR(VLOOKUP(Planning_CallCenter!F37,Shifts!$A$2:$C$10,2,FALSE),)","v":"00:00:00"},{"$f":"IFERROR(VLOOKUP(Planning_CallCenter!F38,Shifts!$A$2:$C$10,2,FALSE),)","v":"00:00:00"},{"$f":"IFERROR(VLOOKUP(Planning_CallCenter!F39,Shifts!$A$2:$C$10,2,FALSE),)","v":"00:00:00"},{"$f":"IFERROR(VLOOKUP(Planning_CallCenter!F40,Shifts!$A$2:$C$10,2,FALSE),)","v":"00:00:00"},{"$f":"IFERROR(VLOOKUP(Planning_CallCenter!F41,Shifts!$A$2:$C$10,2,FALSE),)","v":"00:00:00"},{"$f":"IFERROR(VLOOKUP(Planning_CallCenter!F42,Shifts!$A$2:$C$10,2,FALSE),)","v":"00:00:00"},{"$f":"IFERROR(VLOOKUP(Planning_CallCenter!F43,Shifts!$A$2:$C$10,2,FALSE),)","v":"00:00:00"},{"$f":"IFERROR(VLOOKUP(Planning_CallCenter!F44,Shifts!$A$2:$C$10,2,FALSE),)","v":"00:00:00"},{"$f":"IFERROR(VLOOKUP(Planning_CallCenter!F45,Shifts!$A$2:$C$10,2,FALSE),)","v":"00:00:00"},{"$f":"IFERROR(VLOOKUP(Planning_CallCenter!F46,Shifts!$A$2:$C$10,2,FALSE),)","v":"00:00:00"},{"$f":"IFERROR(VLOOKUP(Planning_CallCenter!F47,Shifts!$A$2:$C$10,2,FALSE),)","v":"00:00:00"}]
["Mer Fins",{"$f":"IFERROR(VLOOKUP(Planning_CallCenter!F8,Shifts!$A$2:$C$10,3,FALSE),)","v":"00:00:00"},{"$f":"IFERROR(VLOOKUP(Planning_CallCenter!F9,Shifts!$A$2:$C$10,3,FALSE),)","v":"00:00:00"},{"$f":"IFERROR(VLOOKUP(Planning_CallCenter!F10,Shifts!$A$2:$C$10,3,FALSE),)","v":"00:00:00"},{"$f":"IFERROR(VLOOKUP(Planning_CallCenter!F11,Shifts!$A$2:$C$10,3,FALSE),)","v":"00:00:00"},{"$f":"IFERROR(VLOOKUP(Planning_CallCenter!F12,Shifts!$A$2:$C$10,3,FALSE),)","v":"00:00:00"},{"$f":"IFERROR(VLOOKUP(Planning_CallCenter!F13,Shifts!$A$2:$C$10,3,FALSE),)","v":"00:00:00"},{"$f":"IFERROR(VLOOKUP(Planning_CallCenter!F14,Shifts!$A$2:$C$10,3,FALSE),)","v":"00:00:00"},{"$f":"IFERROR(VLOOKUP(Planning_CallCenter!F15,Shifts!$A$2:$C$10,3,FALSE),)","v":"00:00:00"},{"$f":"IFERROR(VLOOKUP(Planning_CallCenter!F16,Shifts!$A$2:$C$10,3,FALSE),)","v":"00:00:00"},{"$f":"IFERROR(VLOOKUP(Planning_CallCenter!F17,Shifts!$A$2:$C$10,3,FALSE),)","v":"00:00:00"},{"$f":"IFERROR(VLOOKUP(Planning_CallCenter!F18,Shifts!$A$2:$C$10,3,FALSE),)","v":"00:00:00"},{"$f":"IFERROR(VLOOKUP(Planning_CallCenter!F19,Shifts!$A$2:$C$10,3,FALSE),)","v":"00:00:00"},{"$f":"IFERROR(VLOOKUP(Planning_CallCenter!F20,Shifts!$A$2:$C$10,3,FALSE),)","v":"00:00:00"},{"$f":"IFERROR(VLOOKUP(Planning_CallCenter!F21,Shifts!$A$2:$C$10,3,FALSE),)","v":"00:00:00"},{"$f":"IFERROR(VLOOKUP(Planning_CallCenter!F22,Shifts!$A$2:$C$10,3,FALSE),)","v":"00:00:00"},{"$f":"IFERROR(VLOOKUP(Planning_CallCenter!F23,Shifts!$A$2:$C$10,3,FALSE),)","v":"00:00:00"},{"$f":"IFERROR(VLOOKUP(Planning_CallCenter!F24,Shifts!$A$2:$C$10,3,FALSE),)","v":"00:00:00"},{"$f":"IFERROR(VLOOKUP(Planning_CallCenter!F25,Shifts!$A$2:$C$10,3,FALSE),)","v":"00:00:00"},{"$f":"IFERROR(VLOOKUP(Planning_CallCenter!F26,Shifts!$A$2:$C$10,3,FALSE),)","v":"00:00:00"},{"$f":"IFERROR(VLOOKUP(Planning_CallCenter!F27,Shifts!$A$2:$C$10,3,FALSE),)","v":"00:00:00"},{"$f":"IFERROR(VLOOKUP(Planning_CallCenter!F28,Shifts!$A$2:$C$10,3,FALSE),)","v":"00:00:00"},{"$f":"IFERROR(VLOOKUP(Planning_CallCenter!F29,Shifts!$A$2:$C$10,3,FALSE),)","v":"00:00:00"},{"$f":"IFERROR(VLOOKUP(Planning_CallCenter!F30,Shifts!$A$2:$C$10,3,FALSE),)","v":"00:00:00"},{"$f":"IFERROR(VLOOKUP(Planning_CallCenter!F31,Shifts!$A$2:$C$10,3,FALSE),)","v":"00:00:00"},{"$f":"IFERROR(VLOOKUP(Planning_CallCenter!F32,Shifts!$A$2:$C$10,3,FALSE),)","v":"00:00:00"},{"$f":"IFERROR(VLOOKUP(Planning_CallCenter!F33,Shifts!$A$2:$C$10,3,FALSE),)","v":"00:00:00"},{"$f":"IFERROR(VLOOKUP(Planning_CallCenter!F34,Shifts!$A$2:$C$10,3,FALSE),)","v":"00:00:00"},{"$f":"IFERROR(VLOOKUP(Planning_CallCenter!F35,Shifts!$A$2:$C$10,3,FALSE),)","v":"00:00:00"},{"$f":"IFERROR(VLOOKUP(Planning_CallCenter!F36,Shifts!$A$2:$C$10,3,FALSE),)","v":"00:00:00"},{"$f":"IFERROR(VLOOKUP(Planning_CallCenter!F37,Shifts!$A$2:$C$10,3,FALSE),)","v":"00:00:00"},{"$f":"IFERROR(VLOOKUP(Planning_CallCenter!F38,Shifts!$A$2:$C$10,3,FALSE),)","v":"00:00:00"},{"$f":"IFERROR(VLOOKUP(Planning_CallCenter!F39,Shifts!$A$2:$C$10,3,FALSE),)","v":"00:00:00"},{"$f":"IFERROR(VLOOKUP(Planning_CallCenter!F40,Shifts!$A$2:$C$10,3,FALSE),)","v":"00:00:00"},{"$f":"IFERROR(VLOOKUP(Planning_CallCenter!F41,Shifts!$A$2:$C$10,3,FALSE),)","v":"00:00:00"},{"$f":"IFERROR(VLOOKUP(Planning_CallCenter!F42,Shifts!$A$2:$C$10,3,FALSE),)","v":"00:00:00"},{"$f":"IFERROR(VLOOKUP(Planning_CallCenter!F43,Shifts!$A$2:$C$10,3,FALSE),)","v":"00:00:00"},{"$f":"IFERROR(VLOOKUP(Planning_CallCenter!F44,Shifts!$A$2:$C$10,3,FALSE),)","v":"00:00:00"},{"$f":"IFERROR(VLOOKUP(Planning_CallCenter!F45,Shifts!$A$2:$C$10,3,FALSE),)","v":"00:00:00"},{"$f":"IFERROR(VLOOKUP(Planning_CallCenter!F46,Shifts!$A$2:$C$10,3,FALSE),)","v":"00:00:00"},{"$f":"IFERROR(VLOOKUP(Planning_CallCenter!F47,Shifts!$A$2:$C$10,3,FALSE),)","v":"00:00:00"}]
{"$rows_left_out":13}
{"sheet":"Couverture","index":3,"n_rows":108,"n_cols":5,"rows_kept":108}
["Couverture horaire vs besoin (08:00 → 20:00)"]
[]
["Renseigner 'Besoin' par heure. 'Planifié' s’actualise selon les shifts."]
[]
["Lun","Heure","Besoin","Planifié","Écart"]
[null,"08:00:00",null,{"$f":"COUNTIFS(Heures_Shifts!$B$3:$AO$3,\"<=\"&B6,Heures_Shifts!$B$4:$AO$4,\">\"&B6)","v":0},{"$f":"D6-C6","v":0}]
[null,"09:00:00",null,{"$f":"COUNTIFS(Heures_Shifts!$B$3:$AO$3,\"<=\"&B7,Heures_Shifts!$B$4:$AO$4,\">\"&B7)","v":0},{"$f":"D7-C7","v":0}]
[null,"10:00:00",null,{"$f":"COUNTIFS(Heures_Shifts!$B$3:$AO$3,\"<=\"&B8,Heures_Shifts!$B$4:$AO$4,\">\"&B8)","v":0},{"$f":"D8-C8","v":0}]
[null,"11:00:00",null,{"$f":"COUNTIFS(Heures_Shifts!$B$3:$AO$3,\"<=\"&B9,Heures_Shifts!$B$4:$AO$4,\">\"&B9)","v":0},{"$f":"D9-C9","v":0}]
[null,"12:00:00",null,{"$f":"COUNTIFS(Heures_Shifts!$B$3:$AO$3,\"<=\"&B10,Heures_Shifts!$B$4:$AO$4,\">\"&B10)","v":0},{"$f":"D10-C10","v":0}]
{"$rows_left_out":98}