{"text_format":"3","workbook":"xlsx","n_sheets":3,"sheets":["Articles","BOM","Ordre_Kitting"],"not_rendered":{"defined_names":4},"read":"whole","date_system":"1900"}

{"sheet":"Articles","index":0,"n_rows":8,"n_cols":5,"rows_kept":8,"merged":[[0,0,0,4]]}
["KITTING — Référentiel articles (PMP & stock)"]
[]
["Code","Désignation","Unité","PMP","Stock"]
["PROD-CHAIR","Chaise assemblée","PIECE",0,0]
["CMP-PIED","Pied métal","PIECE",3.5,120]
["CMP-ASS","Assise bois","PIECE",5,80]
["CMP-DOS","Dossier bois","PIECE",4,85]
["CMP-VIS","Visserie set","PACK",1.2,150]

{"sheet":"BOM","index":1,"n_rows":403,"n_cols":6,"rows_kept":403,"merged":[[0,0,0,5]]}
["KITTING — Nomenclatures (BOM)"]
[]
["Produit","Code composant","Désignation","Qté par","Unité","rk_sel"]
["PROD-CHAIR","CMP-PIED","Pied métal",4,"PIECE",{"$f":"IF(A4=Ordre_Kitting!$B$3,COUNTIF($A$4:A4,Ordre_Kitting!$B$3),\"\")","v":null}]
["PROD-CHAIR","CMP-ASS","Assise bois",1,"PIECE",{"$f":"IF(A5=Ordre_Kitting!$B$3,COUNTIF($A$4:A5,Ordre_Kitting!$B$3),\"\")","v":null}]
["PROD-CHAIR","CMP-DOS","Dossier bois",1,"PIECE",{"$f":"IF(A6=Ordre_Kitting!$B$3,COUNTIF($A$4:A6,Ordre_Kitting!$B$3),\"\")","v":null}]
["PROD-CHAIR","CMP-VIS","Visserie set",1,"PACK",{"$f":"IF(A7=Ordre_Kitting!$B$3,COUNTIF($A$4:A7,Ordre_Kitting!$B$3),\"\")","v":null}]
[{"$nulls":5},{"$f":"IF(A8=Ordre_Kitting!$B$3,COUNTIF($A$4:A8,Ordre_Kitting!$B$3),\"\")","v":null}]
[{"$nulls":5},{"$f":"IF(A9=Ordre_Kitting!$B$3,COUNTIF($A$4:A9,Ordre_Kitting!$B$3),\"\")","v":null}]
[{"$nulls":5},{"$f":"IF(A10=Ordre_Kitting!$B$3,COUNTIF($A$4:A10,Ordre_Kitting!$B$3),\"\")","v":null}]
[{"$nulls":5},{"$f":"IF(A11=Ordre_Kitting!$B$3,COUNTIF($A$4:A11,Ordre_Kitting!$B$3),\"\")","v":null}]
[{"$nulls":5},{"$f":"IF(A12=Ordre_Kitting!$B$3,COUNTIF($A$4:A12,Ordre_Kitting!$B$3),\"\")","v":null}]
[{"$nulls":5},{"$f":"IF(A13=Ordre_Kitting!$B$3,COUNTIF($A$4:A13,Ordre_Kitting!$B$3),\"\")","v":null}]
[{"$nulls":5},{"$f":"IF(A14=Ordre_Kitting!$B$3,COUNTIF($A$4:A14,Ordre_Kitting!$B$3),\"\")","v":null}]
[{"$nulls":5},{"$f":"IF(A15=Ordre_Kitting!$B$3,COUNTIF($A$4:A15,Ordre_Kitting!$B$3),\"\")","v":null}]
[{"$nulls":5},{"$f":"IF(A16=Ordre_Kitting!$B$3,COUNTIF($A$4:A16,Ordre_Kitting!$B$3),\"\")","v":null}]
[{"$nulls":5},{"$f":"IF(A17=Ordre_Kitting!$B$3,COUNTIF($A$4:A17,Ordre_Kitting!$B$3),\"\")","v":null}]
[{"$nulls":5},{"$f":"IF(A18=Ordre_Kitting!$B$3,COUNTIF($A$4:A18,Ordre_Kitting!$B$3),\"\")","v":null}]
[{"$nulls":5},{"$f":"IF(A19=Ordre_Kitting!$B$3,COUNTIF($A$4:A19,Ordre_Kitting!$B$3),\"\")","v":null}]
[{"$nulls":5},{"$f":"IF(A20=Ordre_Kitting!$B$3,COUNTIF($A$4:A20,Ordre_Kitting!$B$3),\"\")","v":null}]
[{"$nulls":5},{"$f":"IF(A21=Ordre_Kitting!$B$3,COUNTIF($A$4:A21,Ordre_Kitting!$B$3),\"\")","v":null}]
[{"$nulls":5},{"$f":"IF(A22=Ordre_Kitting!$B$3,COUNTIF($A$4:A22,Ordre_Kitting!$B$3),\"\")","v":null}]
[{"$nulls":5},{"$f":"IF(A23=Ordre_Kitting!$B$3,COUNTIF($A$4:A23,Ordre_Kitting!$B$3),\"\")","v":null}]
[{"$nulls":5},{"$f":"IF(A24=Ordre_Kitting!$B$3,COUNTIF($A$4:A24,Ordre_Kitting!$B$3),\"\")","v":null}]
[{"$nulls":5},{"$f":"IF(A25=Ordre_Kitting!$B$3,COUNTIF($A$4:A25,Ordre_Kitting!$B$3),\"\")","v":null}]
[{"$nulls":5},{"$f":"IF(A26=Ordre_Kitting!$B$3,COUNTIF($A$4:A26,Ordre_Kitting!$B$3),\"\")","v":null}]
[{"$nulls":5},{"$f":"IF(A27=Ordre_Kitting!$B$3,COUNTIF($A$4:A27,Ordre_Kitting!$B$3),\"\")","v":null}]
[{"$nulls":5},{"$f":"IF(A28=Ordre_Kitting!$B$3,COUNTIF($A$4:A28,Ordre_Kitting!$B$3),\"\")","v":null}]
[{"$nulls":5},{"$f":"IF(A29=Ordre_Kitting!$B$3,COUNTIF($A$4:A29,Ordre_Kitting!$B$3),\"\")","v":null}]
[{"$nulls":5},{"$f":"IF(A30=Ordre_Kitting!$B$3,COUNTIF($A$4:A30,Ordre_Kitting!$B$3),\"\")","v":null}]
[{"$nulls":5},{"$f":"IF(A31=Ordre_Kitting!$B$3,COUNTIF($A$4:A31,Ordre_Kitting!$B$3),\"\")","v":null}]
[{"$nulls":5},{"$f":"IF(A32=Ordre_Kitting!$B$3,COUNTIF($A$4:A32,Ordre_Kitting!$B$3),\"\")","v":null}]
[{"$nulls":5},{"$f":"IF(A33=Ordre_Kitting!$B$3,COUNTIF($A$4:A33,Ordre_Kitting!$B$3),\"\")","v":null}]
[{"$nulls":5},{"$f":"IF(A34=Ordre_Kitting!$B$3,COUNTIF($A$4:A34,Ordre_Kitting!$B$3),\"\")","v":null}]
[{"$nulls":5},{"$f":"IF(A35=Ordre_Kitting!$B$3,COUNTIF($A$4:A35,Ordre_Kitting!$B$3),\"\")","v":null}]
[{"$nulls":5},{"$f":"IF(A36=Ordre_Kitting!$B$3,COUNTIF($A$4:A36,Ordre_Kitting!$B$3),\"\")","v":null}]
[{"$nulls":5},{"$f":"IF(A37=Ordre_Kitting!$B$3,COUNTIF($A$4:A37,Ordre_Kitting!$B$3),\"\")","v":null}]
[{"$nulls":5},{"$f":"IF(A38=Ordre_Kitting!$B$3,COUNTIF($A$4:A38,Ordre_Kitting!$B$3),\"\")","v":null}]
[{"$nulls":5},{"$f":"IF(A39=Ordre_Kitting!$B$3,COUNTIF($A$4:A39,Ordre_Kitting!$B$3),\"\")","v":null}]
[{"$nulls":5},{"$f":"IF(A40=Ordre_Kitting!$B$3,COUNTIF($A$4:A40,Ordre_Kitting!$B$3),\"\")","v":null}]
[{"$nulls":5},{"$f":"IF(A41=Ordre_Kitting!$B$3,COUNTIF($A$4:A41,Ordre_Kitting!$B$3),\"\")","v":null}]
[{"$nulls":5},{"$f":"IF(A42=Ordre_Kitting!$B$3,COUNTIF($A$4:A42,Ordre_Kitting!$B$3),\"\")","v":null}]
[{"$nulls":5},{"$f":"IF(A43=Ordre_Kitting!$B$3,COUNTIF($A$4:A43,Ordre_Kitting!$B$3),\"\")","v":null}]
[{"$nulls":5},{"$f":"IF(A44=Ordre_Kitting!$B$3,COUNTIF($A$4:A44,Ordre_Kitting!$B$3),\"\")","v":null}]
[{"$nulls":5},{"$f":"IF(A45=Ordre_Kitting!$B$3,COUNTIF($A$4:A45,Ordre_Kitting!$B$3),\"\")","v":null}]
[{"$nulls":5},{"$f":"IF(A46=Ordre_Kitting!$B$3,COUNTIF($A$4:A46,Ordre_Kitting!$B$3),\"\")","v":null}]
[{"$nulls":5},{"$f":"IF(A47=Ordre_Kitting!$B$3,COUNTIF($A$4:A47,Ordre_Kitting!$B$3),\"\")","v":null}]
[{"$nulls":5},{"$f":"IF(A48=Ordre_Kitting!$B$3,COUNTIF($A$4:A48,Ordre_Kitting!$B$3),\"\")","v":null}]
[{"$nulls":5},{"$f":"IF(A49=Ordre_Kitting!$B$3,COUNTIF($A$4:A49,Ordre_Kitting!$B$3),\"\")","v":null}]
[{"$nulls":5},{"$f":"IF(A50=Ordre_Kitting!$B$3,COUNTIF($A$4:A50,Ordre_Kitting!$B$3),\"\")","v":null}]
[{"$nulls":5},{"$f":"IF(A51=Ordre_Kitting!$B$3,COUNTIF($A$4:A51,Ordre_Kitting!$B$3),\"\")","v":null}]
[{"$nulls":5},{"$f":"IF(A52=Ordre_Kitting!$B$3,COUNTIF($A$4:A52,Ordre_Kitting!$B$3),\"\")","v":null}]
[{"$nulls":5},{"$f":"IF(A53=Ordre_Kitting!$B$3,COUNTIF($A$4:A53,Ordre_Kitting!$B$3),\"\")","v":null}]
[{"$nulls":5},{"$f":"IF(A54=Ordre_Kitting!$B$3,COUNTIF($A$4:A54,Ordre_Kitting!$B$3),\"\")","v":null}]
[{"$nulls":5},{"$f":"IF(A55=Ordre_Kitting!$B$3,COUNTIF($A$4:A55,Ordre_Kitting!$B$3),\"\")","v":null}]
[{"$nulls":5},{"$f":"IF(A56=Ordre_Kitting!$B$3,COUNTIF($A$4:A56,Ordre_Kitting!$B$3),\"\")","v":null}]
[{"$nulls":5},{"$f":"IF(A57=Ordre_Kitting!$B$3,COUNTIF($A$4:A57,Ordre_Kitting!$B$3),\"\")","v":null}]
[{"$nulls":5},{"$f":"IF(A58=Ordre_Kitting!$B$3,COUNTIF($A$4:A58,Ordre_Kitting!$B$3),\"\")","v":null}]
[{"$nulls":5},{"$f":"IF(A59=Ordre_Kitting!$B$3,COUNTIF($A$4:A59,Ordre_Kitting!$B$3),\"\")","v":null}]
[{"$nulls":5},{"$f":"IF(A60=Ordre_Kitting!$B$3,COUNTIF($A$4:A60,Ordre_Kitting!$B$3),\"\")","v":null}]
{"$rows_left_out":344}
{"sheet":"Ordre_Kitting","index":2,"n_rows":37,"n_cols":12,"rows_kept":37,"merged":[[0,0,0,11]]}
["ORDRE DE KITTING — Picklist & ruptures"]
[]
["Produit","Qté à fabriquer","Date & heure","Magasin","Emplacement","Préparateur","Motif","Statut qualité","QR (texte)","—","—","—"]
[{"$nulls":8},"LCG|TYPE=KITTING|PROD={B4}|Q={C4}|V=1"]
[]
["#","Code composant","Désignation","Qté par","Unité","Qté requise","Stock dispo","Rupture","PMP","Valeur rupture","Obs"]
[1,{"$f":"IFERROR(INDEX(BOM!$B:$B,MATCH(A7,BOM!$F:$F,0)),\"\")","v":null},{"$f":"IFERROR(INDEX(BOM!$C:$C,MATCH(A7,BOM!$F:$F,0)),\"\")","v":null},{"$f":"IFERROR(INDEX(BOM!$D:$D,MATCH(A7,BOM!$F:$F,0)),\"\")","v":null},{"$f":"IFERROR(INDEX(BOM!$E:$E,MATCH(A7,BOM!$F:$F,0)),\"\")","v":null},{"$f":"IF(AND(D7<>\"\",$C$4<>\"\"),D7*$C$4,\"\")","v":null},{"$f":"IFERROR(VLOOKUP(B7,Articles!$A:$E,5,FALSE),\"\")","v":null},{"$f":"IF(AND(F7<>\"\",G7<>\"\"),MAX(0,F7-G7),\"\")","v":null},{"$f":"IFERROR(VLOOKUP(B7,Articles!$A:$E,4,FALSE),\"\")","v":null},{"$f":"IF(AND(H7<>\"\",I7<>\"\"),H7*I7,\"\")","v":null}]
[2,{"$f":"IFERROR(INDEX(BOM!$B:$B,MATCH(A8,BOM!$F:$F,0)),\"\")","v":null},{"$f":"IFERROR(INDEX(BOM!$C:$C,MATCH(A8,BOM!$F:$F,0)),\"\")","v":null},{"$f":"IFERROR(INDEX(BOM!$D:$D,MATCH(A8,BOM!$F:$F,0)),\"\")","v":null},{"$f":"IFERROR(INDEX(BOM!$E:$E,MATCH(A8,BOM!$F:$F,0)),\"\")","v":null},{"$f":"IF(AND(D8<>\"\",$C$4<>\"\"),D8*$C$4,\"\")","v":null},{"$f":"IFERROR(VLOOKUP(B8,Articles!$A:$E,5,FALSE),\"\")","v":null},{"$f":"IF(AND(F8<>\"\",G8<>\"\"),MAX(0,F8-G8),\"\")","v":null},{"$f":"IFERROR(VLOOKUP(B8,Articles!$A:$E,4,FALSE),\"\")","v":null},{"$f":"IF(AND(H8<>\"\",I8<>\"\"),H8*I8,\"\")","v":null}]
[3,{"$f":"IFERROR(INDEX(BOM!$B:$B,MATCH(A9,BOM!$F:$F,0)),\"\")","v":null},{"$f":"IFERROR(INDEX(BOM!$C:$C,MATCH(A9,BOM!$F:$F,0)),\"\")","v":null},{"$f":"IFERROR(INDEX(BOM!$D:$D,MATCH(A9,BOM!$F:$F,0)),\"\")","v":null},{"$f":"IFERROR(INDEX(BOM!$E:$E,MATCH(A9,BOM!$F:$F,0)),\"\")","v":null},{"$f":"IF(AND(D9<>\"\",$C$4<>\"\"),D9*$C$4,\"\")","v":null},{"$f":"IFERROR(VLOOKUP(B9,Articles!$A:$E,5,FALSE),\"\")","v":null},{"$f":"IF(AND(F9<>\"\",G9<>\"\"),MAX(0,F9-G9),\"\")","v":null},{"$f":"IFERROR(VLOOKUP(B9,Articles!$A:$E,4,FALSE),\"\")","v":null},{"$f":"IF(AND(H9<>\"\",I9<>\"\"),H9*I9,\"\")","v":null}]
[4,{"$f":"IFERROR(INDEX(BOM!$B:$B,MATCH(A10,BOM!$F:$F,0)),\"\")","v":null},{"$f":"IFERROR(INDEX(BOM!$C:$C,MATCH(A10,BOM!$F:$F,0)),\"\")","v":null},{"$f":"IFERROR(INDEX(BOM!$D:$D,MATCH(A10,BOM!$F:$F,0)),\"\")","v":null},{"$f":"IFERROR(INDEX(BOM!$E:$E,MATCH(A10,BOM!$F:$F,0)),\"\")","v":null},{"$f":"IF(AND(D10<>\"\",$C$4<>\"\"),D10*$C$4,\"\")","v":null},{"$f":"IFERROR(VLOOKUP(B10,Articles!$A:$E,5,FALSE),\"\")","v":null},{"$f":"IF(AND(F10<>\"\",G10<>\"\"),MAX(0,F10-G10),\"\")","v":null},{"$f":"IFERROR(VLOOKUP(B10,Articles!$A:$E,4,FALSE),\"\")","v":null},{"$f":"IF(AND(H10<>\"\",I10<>\"\"),H10*I10,\"\")","v":null}]
[5,{"$f":"IFERROR(INDEX(BOM!$B:$B,MATCH(A11,BOM!$F:$F,0)),\"\")","v":null},{"$f":"IFERROR(INDEX(BOM!$C:$C,MATCH(A11,BOM!$F:$F,0)),\"\")","v":null},{"$f":"IFERROR(INDEX(BOM!$D:$D,MATCH(A11,BOM!$F:$F,0)),\"\")","v":null},{"$f":"IFERROR(INDEX(BOM!$E:$E,MATCH(A11,BOM!$F:$F,0)),\"\")","v":null},{"$f":"IF(AND(D11<>\"\",$C$4<>\"\"),D11*$C$4,\"\")","v":null},{"$f":"IFERROR(VLOOKUP(B11,Articles!$A:$E,5,FALSE),\"\")","v":null},{"$f":"IF(AND(F11<>\"\",G11<>\"\"),MAX(0,F11-G11),\"\")","v":null},{"$f":"IFERROR(VLOOKUP(B11,Articles!$A:$E,4,FALSE),\"\")","v":null},{"$f":"IF(AND(H11<>\"\",I11<>\"\"),H11*I11,\"\")","v":null}]
[6,{"$f":"IFERROR(INDEX(BOM!$B:$B,MATCH(A12,BOM!$F:$F,0)),\"\")","v":null},{"$f":"IFERROR(INDEX(BOM!$C:$C,MATCH(A12,BOM!$F:$F,0)),\"\")","v":null},{"$f":"IFERROR(INDEX(BOM!$D:$D,MATCH(A12,BOM!$F:$F,0)),\"\")","v":null},{"$f":"IFERROR(INDEX(BOM!$E:$E,MATCH(A12,BOM!$F:$F,0)),\"\")","v":null},{"$f":"IF(AND(D12<>\"\",$C$4<>\"\"),D12*$C$4,\"\")","v":null},{"$f":"IFERROR(VLOOKUP(B12,Articles!$A:$E,5,FALSE),\"\")","v":null},{"$f":"IF(AND(F12<>\"\",G12<>\"\"),MAX(0,F12-G12),\"\")","v":null},{"$f":"IFERROR(VLOOKUP(B12,Articles!$A:$E,4,FALSE),\"\")","v":null},{"$f":"IF(AND(H12<>\"\",I12<>\"\"),H12*I12,\"\")","v":null}]
[7,{"$f":"IFERROR(INDEX(BOM!$B:$B,MATCH(A13,BOM!$F:$F,0)),\"\")","v":null},{"$f":"IFERROR(INDEX(BOM!$C:$C,MATCH(A13,BOM!$F:$F,0)),\"\")","v":null},{"$f":"IFERROR(INDEX(BOM!$D:$D,MATCH(A13,BOM!$F:$F,0)),\"\")","v":null},{"$f":"IFERROR(INDEX(BOM!$E:$E,MATCH(A13,BOM!$F:$F,0)),\"\")","v":null},{"$f":"IF(AND(D13<>\"\",$C$4<>\"\"),D13*$C$4,\"\")","v":null},{"$f":"IFERROR(VLOOKUP(B13,Articles!$A:$E,5,FALSE),\"\")","v":null},{"$f":"IF(AND(F13<>\"\",G13<>\"\"),MAX(0,F13-G13),\"\")","v":null},{"$f":"IFERROR(VLOOKUP(B13,Articles!$A:$E,4,FALSE),\"\")","v":null},{"$f":"IF(AND(H13<>\"\",I13<>\"\"),H13*I13,\"\")","v":null}]
[8,{"$f":"IFERROR(INDEX(BOM!$B:$B,MATCH(A14,BOM!$F:$F,0)),\"\")","v":null},{"$f":"IFERROR(INDEX(BOM!$C:$C,MATCH(A14,BOM!$F:$F,0)),\"\")","v":null},{"$f":"IFERROR(INDEX(BOM!$D:$D,MATCH(A14,BOM!$F:$F,0)),\"\")","v":null},{"$f":"IFERROR(INDEX(BOM!$E:$E,MATCH(A14,BOM!$F:$F,0)),\"\")","v":null},{"$f":"IF(AND(D14<>\"\",$C$4<>\"\"),D14*$C$4,\"\")","v":null},{"$f":"IFERROR(VLOOKUP(B14,Articles!$A:$E,5,FALSE),\"\")","v":null},{"$f":"IF(AND(F14<>\"\",G14<>\"\"),MAX(0,F14-G14),\"\")","v":null},{"$f":"IFERROR(VLOOKUP(B14,Articles!$A:$E,4,FALSE),\"\")","v":null},{"$f":"IF(AND(H14<>\"\",I14<>\"\"),H14*I14,\"\")","v":null}]
[9,{"$f":"IFERROR(INDEX(BOM!$B:$B,MATCH(A15,BOM!$F:$F,0)),\"\")","v":null},{"$f":"IFERROR(INDEX(BOM!$C:$C,MATCH(A15,BOM!$F:$F,0)),\"\")","v":null},{"$f":"IFERROR(INDEX(BOM!$D:$D,MATCH(A15,BOM!$F:$F,0)),\"\")","v":null},{"$f":"IFERROR(INDEX(BOM!$E:$E,MATCH(A15,BOM!$F:$F,0)),\"\")","v":null},{"$f":"IF(AND(D15<>\"\",$C$4<>\"\"),D15*$C$4,\"\")","v":null},{"$f":"IFERROR(VLOOKUP(B15,Articles!$A:$E,5,FALSE),\"\")","v":null},{"$f":"IF(AND(F15<>\"\",G15<>\"\"),MAX(0,F15-G15),\"\")","v":null},{"$f":"IFERROR(VLOOKUP(B15,Articles!$A:$E,4,FALSE),\"\")","v":null},{"$f":"IF(AND(H15<>\"\",I15<>\"\"),H15*I15,\"\")","v":null}]
[10,{"$f":"IFERROR(INDEX(BOM!$B:$B,MATCH(A16,BOM!$F:$F,0)),\"\")","v":null},{"$f":"IFERROR(INDEX(BOM!$C:$C,MATCH(A16,BOM!$F:$F,0)),\"\")","v":null},{"$f":"IFERROR(INDEX(BOM!$D:$D,MATCH(A16,BOM!$F:$F,0)),\"\")","v":null},{"$f":"IFERROR(INDEX(BOM!$E:$E,MATCH(A16,BOM!$F:$F,0)),\"\")","v":null},{"$f":"IF(AND(D16<>\"\",$C$4<>\"\"),D16*$C$4,\"\")","v":null},{"$f":"IFERROR(VLOOKUP(B16,Articles!$A:$E,5,FALSE),\"\")","v":null},{"$f":"IF(AND(F16<>\"\",G16<>\"\"),MAX(0,F16-G16),\"\")","v":null},{"$f":"IFERROR(VLOOKUP(B16,Articles!$A:$E,4,FALSE),\"\")","v":null},{"$f":"IF(AND(H16<>\"\",I16<>\"\"),H16*I16,\"\")","v":null}]
[11,{"$f":"IFERROR(INDEX(BOM!$B:$B,MATCH(A17,BOM!$F:$F,0)),\"\")","v":null},{"$f":"IFERROR(INDEX(BOM!$C:$C,MATCH(A17,BOM!$F:$F,0)),\"\")","v":null},{"$f":"IFERROR(INDEX(BOM!$D:$D,MATCH(A17,BOM!$F:$F,0)),\"\")","v":null},{"$f":"IFERROR(INDEX(BOM!$E:$E,MATCH(A17,BOM!$F:$F,0)),\"\")","v":null},{"$f":"IF(AND(D17<>\"\",$C$4<>\"\"),D17*$C$4,\"\")","v":null},{"$f":"IFERROR(VLOOKUP(B17,Articles!$A:$E,5,FALSE),\"\")","v":null},{"$f":"IF(AND(F17<>\"\",G17<>\"\"),MAX(0,F17-G17),\"\")","v":null},{"$f":"IFERROR(VLOOKUP(B17,Articles!$A:$E,4,FALSE),\"\")","v":null},{"$f":"IF(AND(H17<>\"\",I17<>\"\"),H17*I17,\"\")","v":null}]
[12,{"$f":"IFERROR(INDEX(BOM!$B:$B,MATCH(A18,BOM!$F:$F,0)),\"\")","v":null},{"$f":"IFERROR(INDEX(BOM!$C:$C,MATCH(A18,BOM!$F:$F,0)),\"\")","v":null},{"$f":"IFERROR(INDEX(BOM!$D:$D,MATCH(A18,BOM!$F:$F,0)),\"\")","v":null},{"$f":"IFERROR(INDEX(BOM!$E:$E,MATCH(A18,BOM!$F:$F,0)),\"\")","v":null},{"$f":"IF(AND(D18<>\"\",$C$4<>\"\"),D18*$C$4,\"\")","v":null},{"$f":"IFERROR(VLOOKUP(B18,Articles!$A:$E,5,FALSE),\"\")","v":null},{"$f":"IF(AND(F18<>\"\",G18<>\"\"),MAX(0,F18-G18),\"\")","v":null},{"$f":"IFERROR(VLOOKUP(B18,Articles!$A:$E,4,FALSE),\"\")","v":null},{"$f":"IF(AND(H18<>\"\",I18<>\"\"),H18*I18,\"\")","v":null}]
[13,{"$f":"IFERROR(INDEX(BOM!$B:$B,MATCH(A19,BOM!$F:$F,0)),\"\")","v":null},{"$f":"IFERROR(INDEX(BOM!$C:$C,MATCH(A19,BOM!$F:$F,0)),\"\")","v":null},{"$f":"IFERROR(INDEX(BOM!$D:$D,MATCH(A19,BOM!$F:$F,0)),\"\")","v":null},{"$f":"IFERROR(INDEX(BOM!$E:$E,MATCH(A19,BOM!$F:$F,0)),\"\")","v":null},{"$f":"IF(AND(D19<>\"\",$C$4<>\"\"),D19*$C$4,\"\")","v":null},{"$f":"IFERROR(VLOOKUP(B19,Articles!$A:$E,5,FALSE),\"\")","v":null},{"$f":"IF(AND(F19<>\"\",G19<>\"\"),MAX(0,F19-G19),\"\")","v":null},{"$f":"IFERROR(VLOOKUP(B19,Articles!$A:$E,4,FALSE),\"\")","v":null},{"$f":"IF(AND(H19<>\"\",I19<>\"\"),H19*I19,\"\")","v":null}]
[14,{"$f":"IFERROR(INDEX(BOM!$B:$B,MATCH(A20,BOM!$F:$F,0)),\"\")","v":null},{"$f":"IFERROR(INDEX(BOM!$C:$C,MATCH(A20,BOM!$F:$F,0)),\"\")","v":null},{"$f":"IFERROR(INDEX(BOM!$D:$D,MATCH(A20,BOM!$F:$F,0)),\"\")","v":null},{"$f":"IFERROR(INDEX(BOM!$E:$E,MATCH(A20,BOM!$F:$F,0)),\"\")","v":null},{"$f":"IF(AND(D20<>\"\",$C$4<>\"\"),D20*$C$4,\"\")","v":null},{"$f":"IFERROR(VLOOKUP(B20,Articles!$A:$E,5,FALSE),\"\")","v":null},{"$f":"IF(AND(F20<>\"\",G20<>\"\"),MAX(0,F20-G20),\"\")","v":null},{"$f":"IFERROR(VLOOKUP(B20,Articles!$A:$E,4,FALSE),\"\")","v":null},{"$f":"IF(AND(H20<>\"\",I20<>\"\"),H20*I20,\"\")","v":null}]
[15,{"$f":"IFERROR(INDEX(BOM!$B:$B,MATCH(A21,BOM!$F:$F,0)),\"\")","v":null},{"$f":"IFERROR(INDEX(BOM!$C:$C,MATCH(A21,BOM!$F:$F,0)),\"\")","v":null},{"$f":"IFERROR(INDEX(BOM!$D:$D,MATCH(A21,BOM!$F:$F,0)),\"\")","v":null},{"$f":"IFERROR(INDEX(BOM!$E:$E,MATCH(A21,BOM!$F:$F,0)),\"\")","v":null},{"$f":"IF(AND(D21<>\"\",$C$4<>\"\"),D21*$C$4,\"\")","v":null},{"$f":"IFERROR(VLOOKUP(B21,Articles!$A:$E,5,FALSE),\"\")","v":null},{"$f":"IF(AND(F21<>\"\",G21<>\"\"),MAX(0,F21-G21),\"\")","v":null},{"$f":"IFERROR(VLOOKUP(B21,Articles!$A:$E,4,FALSE),\"\")","v":null},{"$f":"IF(AND(H21<>\"\",I21<>\"\"),H21*I21,\"\")","v":null}]
[16,{"$f":"IFERROR(INDEX(BOM!$B:$B,MATCH(A22,BOM!$F:$F,0)),\"\")","v":null},{"$f":"IFERROR(INDEX(BOM!$C:$C,MATCH(A22,BOM!$F:$F,0)),\"\")","v":null},{"$f":"IFERROR(INDEX(BOM!$D:$D,MATCH(A22,BOM!$F:$F,0)),\"\")","v":null},{"$f":"IFERROR(INDEX(BOM!$E:$E,MATCH(A22,BOM!$F:$F,0)),\"\")","v":null},{"$f":"IF(AND(D22<>\"\",$C$4<>\"\"),D22*$C$4,\"\")","v":null},{"$f":"IFERROR(VLOOKUP(B22,Articles!$A:$E,5,FALSE),\"\")","v":null},{"$f":"IF(AND(F22<>\"\",G22<>\"\"),MAX(0,F22-G22),\"\")","v":null},{"$f":"IFERROR(VLOOKUP(B22,Articles!$A:$E,4,FALSE),\"\")","v":null},{"$f":"IF(AND(H22<>\"\",I22<>\"\"),H22*I22,\"\")","v":null}]
[17,{"$f":"IFERROR(INDEX(BOM!$B:$B,MATCH(A23,BOM!$F:$F,0)),\"\")","v":null},{"$f":"IFERROR(INDEX(BOM!$C:$C,MATCH(A23,BOM!$F:$F,0)),\"\")","v":null},{"$f":"IFERROR(INDEX(BOM!$D:$D,MATCH(A23,BOM!$F:$F,0)),\"\")","v":null},{"$f":"IFERROR(INDEX(BOM!$E:$E,MATCH(A23,BOM!$F:$F,0)),\"\")","v":null},{"$f":"IF(AND(D23<>\"\",$C$4<>\"\"),D23*$C$4,\"\")","v":null},{"$f":"IFERROR(VLOOKUP(B23,Articles!$A:$E,5,FALSE),\"\")","v":null},{"$f":"IF(AND(F23<>\"\",G23<>\"\"),MAX(0,F23-G23),\"\")","v":null},{"$f":"IFERROR(VLOOKUP(B23,Articles!$A:$E,4,FALSE),\"\")","v":null},{"$f":"IF(AND(H23<>\"\",I23<>\"\"),H23*I23,\"\")","v":null}]
[18,{"$f":"IFERROR(INDEX(BOM!$B:$B,MATCH(A24,BOM!$F:$F,0)),\"\")","v":null},{"$f":"IFERROR(INDEX(BOM!$C:$C,MATCH(A24,BOM!$F:$F,0)),\"\")","v":null},{"$f":"IFERROR(INDEX(BOM!$D:$D,MATCH(A24,BOM!$F:$F,0)),\"\")","v":null},{"$f":"IFERROR(INDEX(BOM!$E:$E,MATCH(A24,BOM!$F:$F,0)),\"\")","v":null},{"$f":"IF(AND(D24<>\"\",$C$4<>\"\"),D24*$C$4,\"\")","v":null},{"$f":"IFERROR(VLOOKUP(B24,Articles!$A:$E,5,FALSE),\"\")","v":null},{"$f":"IF(AND(F24<>\"\",G24<>\"\"),MAX(0,F24-G24),\"\")","v":null},{"$f":"IFERROR(VLOOKUP(B24,Articles!$A:$E,4,FALSE),\"\")","v":null},{"$f":"IF(AND(H24<>\"\",I24<>\"\"),H24*I24,\"\")","v":null}]
[19,{"$f":"IFERROR(INDEX(BOM!$B:$B,MATCH(A25,BOM!$F:$F,0)),\"\")","v":null},{"$f":"IFERROR(INDEX(BOM!$C:$C,MATCH(A25,BOM!$F:$F,0)),\"\")","v":null},{"$f":"IFERROR(INDEX(BOM!$D:$D,MATCH(A25,BOM!$F:$F,0)),\"\")","v":null},{"$f":"IFERROR(INDEX(BOM!$E:$E,MATCH(A25,BOM!$F:$F,0)),\"\")","v":null},{"$f":"IF(AND(D25<>\"\",$C$4<>\"\"),D25*$C$4,\"\")","v":null},{"$f":"IFERROR(VLOOKUP(B25,Articles!$A:$E,5,FALSE),\"\")","v":null},{"$f":"IF(AND(F25<>\"\",G25<>\"\"),MAX(0,F25-G25),\"\")","v":null},{"$f":"IFERROR(VLOOKUP(B25,Articles!$A:$E,4,FALSE),\"\")","v":null},{"$f":"IF(AND(H25<>\"\",I25<>\"\"),H25*I25,\"\")","v":null}]
[20,{"$f":"IFERROR(INDEX(BOM!$B:$B,MATCH(A26,BOM!$F:$F,0)),\"\")","v":null},{"$f":"IFERROR(INDEX(BOM!$C:$C,MATCH(A26,BOM!$F:$F,0)),\"\")","v":null},{"$f":"IFERROR(INDEX(BOM!$D:$D,MATCH(A26,BOM!$F:$F,0)),\"\")","v":null},{"$f":"IFERROR(INDEX(BOM!$E:$E,MATCH(A26,BOM!$F:$F,0)),\"\")","v":null},{"$f":"IF(AND(D26<>\"\",$C$4<>\"\"),D26*$C$4,\"\")","v":null},{"$f":"IFERROR(VLOOKUP(B26,Articles!$A:$E,5,FALSE),\"\")","v":null},{"$f":"IF(AND(F26<>\"\",G26<>\"\"),MAX(0,F26-G26),\"\")","v":null},{"$f":"IFERROR(VLOOKUP(B26,Articles!$A:$E,4,FALSE),\"\")","v":null},{"$f":"IF(AND(H26<>\"\",I26<>\"\"),H26*I26,\"\")","v":null}]
[21,{"$f":"IFERROR(INDEX(BOM!$B:$B,MATCH(A27,BOM!$F:$F,0)),\"\")","v":null},{"$f":"IFERROR(INDEX(BOM!$C:$C,MATCH(A27,BOM!$F:$F,0)),\"\")","v":null},{"$f":"IFERROR(INDEX(BOM!$D:$D,MATCH(A27,BOM!$F:$F,0)),\"\")","v":null},{"$f":"IFERROR(INDEX(BOM!$E:$E,MATCH(A27,BOM!$F:$F,0)),\"\")","v":null},{"$f":"IF(AND(D27<>\"\",$C$4<>\"\"),D27*$C$4,\"\")","v":null},{"$f":"IFERROR(VLOOKUP(B27,Articles!$A:$E,5,FALSE),\"\")","v":null},{"$f":"IF(AND(F27<>\"\",G27<>\"\"),MAX(0,F27-G27),\"\")","v":null},{"$f":"IFERROR(VLOOKUP(B27,Articles!$A:$E,4,FALSE),\"\")","v":null},{"$f":"IF(AND(H27<>\"\",I27<>\"\"),H27*I27,\"\")","v":null}]
[22,{"$f":"IFERROR(INDEX(BOM!$B:$B,MATCH(A28,BOM!$F:$F,0)),\"\")","v":null},{"$f":"IFERROR(INDEX(BOM!$C:$C,MATCH(A28,BOM!$F:$F,0)),\"\")","v":null},{"$f":"IFERROR(INDEX(BOM!$D:$D,MATCH(A28,BOM!$F:$F,0)),\"\")","v":null},{"$f":"IFERROR(INDEX(BOM!$E:$E,MATCH(A28,BOM!$F:$F,0)),\"\")","v":null},{"$f":"IF(AND(D28<>\"\",$C$4<>\"\"),D28*$C$4,\"\")","v":null},{"$f":"IFERROR(VLOOKUP(B28,Articles!$A:$E,5,FALSE),\"\")","v":null},{"$f":"IF(AND(F28<>\"\",G28<>\"\"),MAX(0,F28-G28),\"\")","v":null},{"$f":"IFERROR(VLOOKUP(B28,Articles!$A:$E,4,FALSE),\"\")","v":null},{"$f":"IF(AND(H28<>\"\",I28<>\"\"),H28*I28,\"\")","v":null}]
[23,{"$f":"IFERROR(INDEX(BOM!$B:$B,MATCH(A29,BOM!$F:$F,0)),\"\")","v":null},{"$f":"IFERROR(INDEX(BOM!$C:$C,MATCH(A29,BOM!$F:$F,0)),\"\")","v":null},{"$f":"IFERROR(INDEX(BOM!$D:$D,MATCH(A29,BOM!$F:$F,0)),\"\")","v":null},{"$f":"IFERROR(INDEX(BOM!$E:$E,MATCH(A29,BOM!$F:$F,0)),\"\")","v":null},{"$f":"IF(AND(D29<>\"\",$C$4<>\"\"),D29*$C$4,\"\")","v":null},{"$f":"IFERROR(VLOOKUP(B29,Articles!$A:$E,5,FALSE),\"\")","v":null},{"$f":"IF(AND(F29<>\"\",G29<>\"\"),MAX(0,F29-G29),\"\")","v":null},{"$f":"IFERROR(VLOOKUP(B29,Articles!$A:$E,4,FALSE),\"\")","v":null},{"$f":"IF(AND(H29<>\"\",I29<>\"\"),H29*I29,\"\")","v":null}]
[24,{"$f":"IFERROR(INDEX(BOM!$B:$B,MATCH(A30,BOM!$F:$F,0)),\"\")","v":null},{"$f":"IFERROR(INDEX(BOM!$C:$C,MATCH(A30,BOM!$F:$F,0)),\"\")","v":null},{"$f":"IFERROR(INDEX(BOM!$D:$D,MATCH(A30,BOM!$F:$F,0)),\"\")","v":null},{"$f":"IFERROR(INDEX(BOM!$E:$E,MATCH(A30,BOM!$F:$F,0)),\"\")","v":null},{"$f":"IF(AND(D30<>\"\",$C$4<>\"\"),D30*$C$4,\"\")","v":null},{"$f":"IFERROR(VLOOKUP(B30,Articles!$A:$E,5,FALSE),\"\")","v":null},{"$f":"IF(AND(F30<>\"\",G30<>\"\"),MAX(0,F30-G30),\"\")","v":null},{"$f":"IFERROR(VLOOKUP(B30,Articles!$A:$E,4,FALSE),\"\")","v":null},{"$f":"IF(AND(H30<>\"\",I30<>\"\"),H30*I30,\"\")","v":null}]
[25,{"$f":"IFERROR(INDEX(BOM!$B:$B,MATCH(A31,BOM!$F:$F,0)),\"\")","v":null},{"$f":"IFERROR(INDEX(BOM!$C:$C,MATCH(A31,BOM!$F:$F,0)),\"\")","v":null},{"$f":"IFERROR(INDEX(BOM!$D:$D,MATCH(A31,BOM!$F:$F,0)),\"\")","v":null},{"$f":"IFERROR(INDEX(BOM!$E:$E,MATCH(A31,BOM!$F:$F,0)),\"\")","v":null},{"$f":"IF(AND(D31<>\"\",$C$4<>\"\"),D31*$C$4,\"\")","v":null},{"$f":"IFERROR(VLOOKUP(B31,Articles!$A:$E,5,FALSE),\"\")","v":null},{"$f":"IF(AND(F31<>\"\",G31<>\"\"),MAX(0,F31-G31),\"\")","v":null},{"$f":"IFERROR(VLOOKUP(B31,Articles!$A:$E,4,FALSE),\"\")","v":null},{"$f":"IF(AND(H31<>\"\",I31<>\"\"),H31*I31,\"\")","v":null}]
[26,{"$f":"IFERROR(INDEX(BOM!$B:$B,MATCH(A32,BOM!$F:$F,0)),\"\")","v":null},{"$f":"IFERROR(INDEX(BOM!$C:$C,MATCH(A32,BOM!$F:$F,0)),\"\")","v":null},{"$f":"IFERROR(INDEX(BOM!$D:$D,MATCH(A32,BOM!$F:$F,0)),\"\")","v":null},{"$f":"IFERROR(INDEX(BOM!$E:$E,MATCH(A32,BOM!$F:$F,0)),\"\")","v":null},{"$f":"IF(AND(D32<>\"\",$C$4<>\"\"),D32*$C$4,\"\")","v":null},{"$f":"IFERROR(VLOOKUP(B32,Articles!$A:$E,5,FALSE),\"\")","v":null},{"$f":"IF(AND(F32<>\"\",G32<>\"\"),MAX(0,F32-G32),\"\")","v":null},{"$f":"IFERROR(VLOOKUP(B32,Articles!$A:$E,4,FALSE),\"\")","v":null},{"$f":"IF(AND(H32<>\"\",I32<>\"\"),H32*I32,\"\")","v":null}]
[27,{"$f":"IFERROR(INDEX(BOM!$B:$B,MATCH(A33,BOM!$F:$F,0)),\"\")","v":null},{"$f":"IFERROR(INDEX(BOM!$C:$C,MATCH(A33,BOM!$F:$F,0)),\"\")","v":null},{"$f":"IFERROR(INDEX(BOM!$D:$D,MATCH(A33,BOM!$F:$F,0)),\"\")","v":null},{"$f":"IFERROR(INDEX(BOM!$E:$E,MATCH(A33,BOM!$F:$F,0)),\"\")","v":null},{"$f":"IF(AND(D33<>\"\",$C$4<>\"\"),D33*$C$4,\"\")","v":null},{"$f":"IFERROR(VLOOKUP(B33,Articles!$A:$E,5,FALSE),\"\")","v":null},{"$f":"IF(AND(F33<>\"\",G33<>\"\"),MAX(0,F33-G33),\"\")","v":null},{"$f":"IFERROR(VLOOKUP(B33,Articles!$A:$E,4,FALSE),\"\")","v":null},{"$f":"IF(AND(H33<>\"\",I33<>\"\"),H33*I33,\"\")","v":null}]
[28,{"$f":"IFERROR(INDEX(BOM!$B:$B,MATCH(A34,BOM!$F:$F,0)),\"\")","v":null},{"$f":"IFERROR(INDEX(BOM!$C:$C,MATCH(A34,BOM!$F:$F,0)),\"\")","v":null},{"$f":"IFERROR(INDEX(BOM!$D:$D,MATCH(A34,BOM!$F:$F,0)),\"\")","v":null},{"$f":"IFERROR(INDEX(BOM!$E:$E,MATCH(A34,BOM!$F:$F,0)),\"\")","v":null},{"$f":"IF(AND(D34<>\"\",$C$4<>\"\"),D34*$C$4,\"\")","v":null},{"$f":"IFERROR(VLOOKUP(B34,Articles!$A:$E,5,FALSE),\"\")","v":null},{"$f":"IF(AND(F34<>\"\",G34<>\"\"),MAX(0,F34-G34),\"\")","v":null},{"$f":"IFERROR(VLOOKUP(B34,Articles!$A:$E,4,FALSE),\"\")","v":null},{"$f":"IF(AND(H34<>\"\",I34<>\"\"),H34*I34,\"\")","v":null}]
[29,{"$f":"IFERROR(INDEX(BOM!$B:$B,MATCH(A35,BOM!$F:$F,0)),\"\")","v":null},{"$f":"IFERROR(INDEX(BOM!$C:$C,MATCH(A35,BOM!$F:$F,0)),\"\")","v":null},{"$f":"IFERROR(INDEX(BOM!$D:$D,MATCH(A35,BOM!$F:$F,0)),\"\")","v":null},{"$f":"IFERROR(INDEX(BOM!$E:$E,MATCH(A35,BOM!$F:$F,0)),\"\")","v":null},{"$f":"IF(AND(D35<>\"\",$C$4<>\"\"),D35*$C$4,\"\")","v":null},{"$f":"IFERROR(VLOOKUP(B35,Articles!$A:$E,5,FALSE),\"\")","v":null},{"$f":"IF(AND(F35<>\"\",G35<>\"\"),MAX(0,F35-G35),\"\")","v":null},{"$f":"IFERROR(VLOOKUP(B35,Articles!$A:$E,4,FALSE),\"\")","v":null},{"$f":"IF(AND(H35<>\"\",I35<>\"\"),H35*I35,\"\")","v":null}]
[30,{"$f":"IFERROR(INDEX(BOM!$B:$B,MATCH(A36,BOM!$F:$F,0)),\"\")","v":null},{"$f":"IFERROR(INDEX(BOM!$C:$C,MATCH(A36,BOM!$F:$F,0)),\"\")","v":null},{"$f":"IFERROR(INDEX(BOM!$D:$D,MATCH(A36,BOM!$F:$F,0)),\"\")","v":null},{"$f":"IFERROR(INDEX(BOM!$E:$E,MATCH(A36,BOM!$F:$F,0)),\"\")","v":null},{"$f":"IF(AND(D36<>\"\",$C$4<>\"\"),D36*$C$4,\"\")","v":null},{"$f":"IFERROR(VLOOKUP(B36,Articles!$A:$E,5,FALSE),\"\")","v":null},{"$f":"IF(AND(F36<>\"\",G36<>\"\"),MAX(0,F36-G36),\"\")","v":null},{"$f":"IFERROR(VLOOKUP(B36,Articles!$A:$E,4,FALSE),\"\")","v":null},{"$f":"IF(AND(H36<>\"\",I36<>\"\"),H36*I36,\"\")","v":null}]
["Σ",{"$nulls":4},{"$f":"SUM(F7:F36)","v":null},null,{"$f":"SUM(H7:H36)","v":null},null,{"$f":"SUM(J7:J36)","v":null}]