{"text_format":"3","workbook":"xlsx","n_sheets":3,"sheets":["Paramètres","Lots","BS_FEFO_Pick"],"not_rendered":{"defined_names":3},"read":"whole","date_system":"1900"}

{"sheet":"Paramètres","index":0,"n_rows":5,"n_cols":2,"rows_kept":5}
["Paramètres FEFO"]
[]
["Seuil alerte Jours restants",30]
["Unités (liste)","PIECE,KG,L,M,PACK,PAL"]
["Statuts qualité","Libre,Quarantaine,Bloqué"]

{"sheet":"Lots","index":1,"n_rows":103,"n_cols":17,"rows_kept":103,"merged":[[0,0,0,16]]}
["FEFO GUARD — Référentiel des lots & vieillissement"]
[]
["Code article","Désignation","Lot/Série","DLC/DPF","Magasin","Empl.","Statut","Qté","Unité","PMP","Valeur","Jours restants","Alerte?","Candidat (Pick)","Rang FEFO","Cum. avant","À PRÉLEVER"]
[{"$nulls":10},{"$f":"IF(AND(H4<>\"\",J4<>\"\"),H4*J4,\"\")","v":null},{"$f":"IF(D4<>\"\",D4-TODAY(),\"\")","v":null},{"$f":"IF(AND(L4<>\"\",L4<=Paramètres!B3),\"OUI\",\"NON\")","v":null},{"$f":"IF(AND(A4=BS_FEFO_Pick!$B$3,G4=\"Libre\",H4>0),1,0)","v":null},{"$f":"IF(N4=1,COUNTIFS($A:$A,A4,$N:$N,1,$D:$D,\"<=\"&D4),\"\")","v":null},{"$f":"IF(N4=1,SUMIFS($H:$H,$A:$A,A4,$N:$N,1,$O:$O,\"<\"&O4),\"\")","v":null},{"$f":"IF(N4=1,MAX(0,MIN(H4,BS_FEFO_Pick!$B$4-P4)),\"\")","v":null}]
[{"$nulls":10},{"$f":"IF(AND(H5<>\"\",J5<>\"\"),H5*J5,\"\")","v":null},{"$f":"IF(D5<>\"\",D5-TODAY(),\"\")","v":null},{"$f":"IF(AND(L5<>\"\",L5<=Paramètres!B3),\"OUI\",\"NON\")","v":null},{"$f":"IF(AND(A5=BS_FEFO_Pick!$B$3,G5=\"Libre\",H5>0),1,0)","v":null},{"$f":"IF(N5=1,COUNTIFS($A:$A,A5,$N:$N,1,$D:$D,\"<=\"&D5),\"\")","v":null},{"$f":"IF(N5=1,SUMIFS($H:$H,$A:$A,A5,$N:$N,1,$O:$O,\"<\"&O5),\"\")","v":null},{"$f":"IF(N5=1,MAX(0,MIN(H5,BS_FEFO_Pick!$B$4-P5)),\"\")","v":null}]
[{"$nulls":10},{"$f":"IF(AND(H6<>\"\",J6<>\"\"),H6*J6,\"\")","v":null},{"$f":"IF(D6<>\"\",D6-TODAY(),\"\")","v":null},{"$f":"IF(AND(L6<>\"\",L6<=Paramètres!B3),\"OUI\",\"NON\")","v":null},{"$f":"IF(AND(A6=BS_FEFO_Pick!$B$3,G6=\"Libre\",H6>0),1,0)","v":null},{"$f":"IF(N6=1,COUNTIFS($A:$A,A6,$N:$N,1,$D:$D,\"<=\"&D6),\"\")","v":null},{"$f":"IF(N6=1,SUMIFS($H:$H,$A:$A,A6,$N:$N,1,$O:$O,\"<\"&O6),\"\")","v":null},{"$f":"IF(N6=1,MAX(0,MIN(H6,BS_FEFO_Pick!$B$4-P6)),\"\")","v":null}]
[{"$nulls":10},{"$f":"IF(AND(H7<>\"\",J7<>\"\"),H7*J7,\"\")","v":null},{"$f":"IF(D7<>\"\",D7-TODAY(),\"\")","v":null},{"$f":"IF(AND(L7<>\"\",L7<=Paramètres!B3),\"OUI\",\"NON\")","v":null},{"$f":"IF(AND(A7=BS_FEFO_Pick!$B$3,G7=\"Libre\",H7>0),1,0)","v":null},{"$f":"IF(N7=1,COUNTIFS($A:$A,A7,$N:$N,1,$D:$D,\"<=\"&D7),\"\")","v":null},{"$f":"IF(N7=1,SUMIFS($H:$H,$A:$A,A7,$N:$N,1,$O:$O,\"<\"&O7),\"\")","v":null},{"$f":"IF(N7=1,MAX(0,MIN(H7,BS_FEFO_Pick!$B$4-P7)),\"\")","v":null}]
[{"$nulls":10},{"$f":"IF(AND(H8<>\"\",J8<>\"\"),H8*J8,\"\")","v":null},{"$f":"IF(D8<>\"\",D8-TODAY(),\"\")","v":null},{"$f":"IF(AND(L8<>\"\",L8<=Paramètres!B3),\"OUI\",\"NON\")","v":null},{"$f":"IF(AND(A8=BS_FEFO_Pick!$B$3,G8=\"Libre\",H8>0),1,0)","v":null},{"$f":"IF(N8=1,COUNTIFS($A:$A,A8,$N:$N,1,$D:$D,\"<=\"&D8),\"\")","v":null},{"$f":"IF(N8=1,SUMIFS($H:$H,$A:$A,A8,$N:$N,1,$O:$O,\"<\"&O8),\"\")","v":null},{"$f":"IF(N8=1,MAX(0,MIN(H8,BS_FEFO_Pick!$B$4-P8)),\"\")","v":null}]
[{"$nulls":10},{"$f":"IF(AND(H9<>\"\",J9<>\"\"),H9*J9,\"\")","v":null},{"$f":"IF(D9<>\"\",D9-TODAY(),\"\")","v":null},{"$f":"IF(AND(L9<>\"\",L9<=Paramètres!B3),\"OUI\",\"NON\")","v":null},{"$f":"IF(AND(A9=BS_FEFO_Pick!$B$3,G9=\"Libre\",H9>0),1,0)","v":null},{"$f":"IF(N9=1,COUNTIFS($A:$A,A9,$N:$N,1,$D:$D,\"<=\"&D9),\"\")","v":null},{"$f":"IF(N9=1,SUMIFS($H:$H,$A:$A,A9,$N:$N,1,$O:$O,\"<\"&O9),\"\")","v":null},{"$f":"IF(N9=1,MAX(0,MIN(H9,BS_FEFO_Pick!$B$4-P9)),\"\")","v":null}]
[{"$nulls":10},{"$f":"IF(AND(H10<>\"\",J10<>\"\"),H10*J10,\"\")","v":null},{"$f":"IF(D10<>\"\",D10-TODAY(),\"\")","v":null},{"$f":"IF(AND(L10<>\"\",L10<=Paramètres!B3),\"OUI\",\"NON\")","v":null},{"$f":"IF(AND(A10=BS_FEFO_Pick!$B$3,G10=\"Libre\",H10>0),1,0)","v":null},{"$f":"IF(N10=1,COUNTIFS($A:$A,A10,$N:$N,1,$D:$D,\"<=\"&D10),\"\")","v":null},{"$f":"IF(N10=1,SUMIFS($H:$H,$A:$A,A10,$N:$N,1,$O:$O,\"<\"&O10),\"\")","v":null},{"$f":"IF(N10=1,MAX(0,MIN(H10,BS_FEFO_Pick!$B$4-P10)),\"\")","v":null}]
[{"$nulls":10},{"$f":"IF(AND(H11<>\"\",J11<>\"\"),H11*J11,\"\")","v":null},{"$f":"IF(D11<>\"\",D11-TODAY(),\"\")","v":null},{"$f":"IF(AND(L11<>\"\",L11<=Paramètres!B3),\"OUI\",\"NON\")","v":null},{"$f":"IF(AND(A11=BS_FEFO_Pick!$B$3,G11=\"Libre\",H11>0),1,0)","v":null},{"$f":"IF(N11=1,COUNTIFS($A:$A,A11,$N:$N,1,$D:$D,\"<=\"&D11),\"\")","v":null},{"$f":"IF(N11=1,SUMIFS($H:$H,$A:$A,A11,$N:$N,1,$O:$O,\"<\"&O11),\"\")","v":null},{"$f":"IF(N11=1,MAX(0,MIN(H11,BS_FEFO_Pick!$B$4-P11)),\"\")","v":null}]
[{"$nulls":10},{"$f":"IF(AND(H12<>\"\",J12<>\"\"),H12*J12,\"\")","v":null},{"$f":"IF(D12<>\"\",D12-TODAY(),\"\")","v":null},{"$f":"IF(AND(L12<>\"\",L12<=Paramètres!B3),\"OUI\",\"NON\")","v":null},{"$f":"IF(AND(A12=BS_FEFO_Pick!$B$3,G12=\"Libre\",H12>0),1,0)","v":null},{"$f":"IF(N12=1,COUNTIFS($A:$A,A12,$N:$N,1,$D:$D,\"<=\"&D12),\"\")","v":null},{"$f":"IF(N12=1,SUMIFS($H:$H,$A:$A,A12,$N:$N,1,$O:$O,\"<\"&O12),\"\")","v":null},{"$f":"IF(N12=1,MAX(0,MIN(H12,BS_FEFO_Pick!$B$4-P12)),\"\")","v":null}]
[{"$nulls":10},{"$f":"IF(AND(H13<>\"\",J13<>\"\"),H13*J13,\"\")","v":null},{"$f":"IF(D13<>\"\",D13-TODAY(),\"\")","v":null},{"$f":"IF(AND(L13<>\"\",L13<=Paramètres!B3),\"OUI\",\"NON\")","v":null},{"$f":"IF(AND(A13=BS_FEFO_Pick!$B$3,G13=\"Libre\",H13>0),1,0)","v":null},{"$f":"IF(N13=1,COUNTIFS($A:$A,A13,$N:$N,1,$D:$D,\"<=\"&D13),\"\")","v":null},{"$f":"IF(N13=1,SUMIFS($H:$H,$A:$A,A13,$N:$N,1,$O:$O,\"<\"&O13),\"\")","v":null},{"$f":"IF(N13=1,MAX(0,MIN(H13,BS_FEFO_Pick!$B$4-P13)),\"\")","v":null}]
[{"$nulls":10},{"$f":"IF(AND(H14<>\"\",J14<>\"\"),H14*J14,\"\")","v":null},{"$f":"IF(D14<>\"\",D14-TODAY(),\"\")","v":null},{"$f":"IF(AND(L14<>\"\",L14<=Paramètres!B3),\"OUI\",\"NON\")","v":null},{"$f":"IF(AND(A14=BS_FEFO_Pick!$B$3,G14=\"Libre\",H14>0),1,0)","v":null},{"$f":"IF(N14=1,COUNTIFS($A:$A,A14,$N:$N,1,$D:$D,\"<=\"&D14),\"\")","v":null},{"$f":"IF(N14=1,SUMIFS($H:$H,$A:$A,A14,$N:$N,1,$O:$O,\"<\"&O14),\"\")","v":null},{"$f":"IF(N14=1,MAX(0,MIN(H14,BS_FEFO_Pick!$B$4-P14)),\"\")","v":null}]
[{"$nulls":10},{"$f":"IF(AND(H15<>\"\",J15<>\"\"),H15*J15,\"\")","v":null},{"$f":"IF(D15<>\"\",D15-TODAY(),\"\")","v":null},{"$f":"IF(AND(L15<>\"\",L15<=Paramètres!B3),\"OUI\",\"NON\")","v":null},{"$f":"IF(AND(A15=BS_FEFO_Pick!$B$3,G15=\"Libre\",H15>0),1,0)","v":null},{"$f":"IF(N15=1,COUNTIFS($A:$A,A15,$N:$N,1,$D:$D,\"<=\"&D15),\"\")","v":null},{"$f":"IF(N15=1,SUMIFS($H:$H,$A:$A,A15,$N:$N,1,$O:$O,\"<\"&O15),\"\")","v":null},{"$f":"IF(N15=1,MAX(0,MIN(H15,BS_FEFO_Pick!$B$4-P15)),\"\")","v":null}]
[{"$nulls":10},{"$f":"IF(AND(H16<>\"\",J16<>\"\"),H16*J16,\"\")","v":null},{"$f":"IF(D16<>\"\",D16-TODAY(),\"\")","v":null},{"$f":"IF(AND(L16<>\"\",L16<=Paramètres!B3),\"OUI\",\"NON\")","v":null},{"$f":"IF(AND(A16=BS_FEFO_Pick!$B$3,G16=\"Libre\",H16>0),1,0)","v":null},{"$f":"IF(N16=1,COUNTIFS($A:$A,A16,$N:$N,1,$D:$D,\"<=\"&D16),\"\")","v":null},{"$f":"IF(N16=1,SUMIFS($H:$H,$A:$A,A16,$N:$N,1,$O:$O,\"<\"&O16),\"\")","v":null},{"$f":"IF(N16=1,MAX(0,MIN(H16,BS_FEFO_Pick!$B$4-P16)),\"\")","v":null}]
[{"$nulls":10},{"$f":"IF(AND(H17<>\"\",J17<>\"\"),H17*J17,\"\")","v":null},{"$f":"IF(D17<>\"\",D17-TODAY(),\"\")","v":null},{"$f":"IF(AND(L17<>\"\",L17<=Paramètres!B3),\"OUI\",\"NON\")","v":null},{"$f":"IF(AND(A17=BS_FEFO_Pick!$B$3,G17=\"Libre\",H17>0),1,0)","v":null},{"$f":"IF(N17=1,COUNTIFS($A:$A,A17,$N:$N,1,$D:$D,\"<=\"&D17),\"\")","v":null},{"$f":"IF(N17=1,SUMIFS($H:$H,$A:$A,A17,$N:$N,1,$O:$O,\"<\"&O17),\"\")","v":null},{"$f":"IF(N17=1,MAX(0,MIN(H17,BS_FEFO_Pick!$B$4-P17)),\"\")","v":null}]
[{"$nulls":10},{"$f":"IF(AND(H18<>\"\",J18<>\"\"),H18*J18,\"\")","v":null},{"$f":"IF(D18<>\"\",D18-TODAY(),\"\")","v":null},{"$f":"IF(AND(L18<>\"\",L18<=Paramètres!B3),\"OUI\",\"NON\")","v":null},{"$f":"IF(AND(A18=BS_FEFO_Pick!$B$3,G18=\"Libre\",H18>0),1,0)","v":null},{"$f":"IF(N18=1,COUNTIFS($A:$A,A18,$N:$N,1,$D:$D,\"<=\"&D18),\"\")","v":null},{"$f":"IF(N18=1,SUMIFS($H:$H,$A:$A,A18,$N:$N,1,$O:$O,\"<\"&O18),\"\")","v":null},{"$f":"IF(N18=1,MAX(0,MIN(H18,BS_FEFO_Pick!$B$4-P18)),\"\")","v":null}]
[{"$nulls":10},{"$f":"IF(AND(H19<>\"\",J19<>\"\"),H19*J19,\"\")","v":null},{"$f":"IF(D19<>\"\",D19-TODAY(),\"\")","v":null},{"$f":"IF(AND(L19<>\"\",L19<=Paramètres!B3),\"OUI\",\"NON\")","v":null},{"$f":"IF(AND(A19=BS_FEFO_Pick!$B$3,G19=\"Libre\",H19>0),1,0)","v":null},{"$f":"IF(N19=1,COUNTIFS($A:$A,A19,$N:$N,1,$D:$D,\"<=\"&D19),\"\")","v":null},{"$f":"IF(N19=1,SUMIFS($H:$H,$A:$A,A19,$N:$N,1,$O:$O,\"<\"&O19),\"\")","v":null},{"$f":"IF(N19=1,MAX(0,MIN(H19,BS_FEFO_Pick!$B$4-P19)),\"\")","v":null}]
[{"$nulls":10},{"$f":"IF(AND(H20<>\"\",J20<>\"\"),H20*J20,\"\")","v":null},{"$f":"IF(D20<>\"\",D20-TODAY(),\"\")","v":null},{"$f":"IF(AND(L20<>\"\",L20<=Paramètres!B3),\"OUI\",\"NON\")","v":null},{"$f":"IF(AND(A20=BS_FEFO_Pick!$B$3,G20=\"Libre\",H20>0),1,0)","v":null},{"$f":"IF(N20=1,COUNTIFS($A:$A,A20,$N:$N,1,$D:$D,\"<=\"&D20),\"\")","v":null},{"$f":"IF(N20=1,SUMIFS($H:$H,$A:$A,A20,$N:$N,1,$O:$O,\"<\"&O20),\"\")","v":null},{"$f":"IF(N20=1,MAX(0,MIN(H20,BS_FEFO_Pick!$B$4-P20)),\"\")","v":null}]
{"$rows_left_out":84}
{"sheet":"BS_FEFO_Pick","index":2,"n_rows":29,"n_cols":12,"rows_kept":29,"merged":[[0,0,0,11],[28,0,28,2],[28,3,28,5],[28,6,28,8],[28,9,28,11]]}
["BON DE SORTIE — Ordre de prélèvement FEFO"]
[]
["Code article","Qté demandée","Date & heure","Magasin","Emplacement","Rédacteur","Motif","Statut qualité","QR (texte)","—","—","—"]
[{"$nulls":8},"LCG|TYPE=BS|ART={B3}|Q={B4}|V=FEFO"]
[]
["Rang","Lot/Série","DLC/DPF","Jours restants","Empl.","Qté lot","À prélever","Unité","PMP","Valeur","Observation"]
[1,{"$f":"IFERROR(INDEX(Lots!$C:$C,=IFERROR(MATCH(1,Lots!$O:$O,0),\"\")),\"\")","v":null},{"$f":"IFERROR(INDEX(Lots!$D:$D,=IFERROR(MATCH(1,Lots!$O:$O,0),\"\")),\"\")","v":null},{"$f":"IFERROR(INDEX(Lots!$L:$L,=IFERROR(MATCH(1,Lots!$O:$O,0),\"\")),\"\")","v":null},{"$f":"IFERROR(INDEX(Lots!$F:$F,=IFERROR(MATCH(1,Lots!$O:$O,0),\"\")),\"\")","v":null},{"$f":"IFERROR(INDEX(Lots!$H:$H,=IFERROR(MATCH(1,Lots!$O:$O,0),\"\")),\"\")","v":null},{"$f":"IFERROR(INDEX(Lots!$Q:$Q,=IFERROR(MATCH(1,Lots!$O:$O,0),\"\")),\"\")","v":null},{"$f":"IFERROR(INDEX(Lots!$I:$I,=IFERROR(MATCH(1,Lots!$O:$O,0),\"\")),\"\")","v":null},{"$f":"IFERROR(INDEX(Lots!$J:$J,=IFERROR(MATCH(1,Lots!$O:$O,0),\"\")),\"\")","v":null},{"$f":"IFERROR($I7*$G7,\"\")","v":null}]
[2,{"$f":"IFERROR(INDEX(Lots!$C:$C,=IFERROR(MATCH(2,Lots!$O:$O,0),\"\")),\"\")","v":null},{"$f":"IFERROR(INDEX(Lots!$D:$D,=IFERROR(MATCH(2,Lots!$O:$O,0),\"\")),\"\")","v":null},{"$f":"IFERROR(INDEX(Lots!$L:$L,=IFERROR(MATCH(2,Lots!$O:$O,0),\"\")),\"\")","v":null},{"$f":"IFERROR(INDEX(Lots!$F:$F,=IFERROR(MATCH(2,Lots!$O:$O,0),\"\")),\"\")","v":null},{"$f":"IFERROR(INDEX(Lots!$H:$H,=IFERROR(MATCH(2,Lots!$O:$O,0),\"\")),\"\")","v":null},{"$f":"IFERROR(INDEX(Lots!$Q:$Q,=IFERROR(MATCH(2,Lots!$O:$O,0),\"\")),\"\")","v":null},{"$f":"IFERROR(INDEX(Lots!$I:$I,=IFERROR(MATCH(2,Lots!$O:$O,0),\"\")),\"\")","v":null},{"$f":"IFERROR(INDEX(Lots!$J:$J,=IFERROR(MATCH(2,Lots!$O:$O,0),\"\")),\"\")","v":null},{"$f":"IFERROR($I8*$G8,\"\")","v":null}]
[3,{"$f":"IFERROR(INDEX(Lots!$C:$C,=IFERROR(MATCH(3,Lots!$O:$O,0),\"\")),\"\")","v":null},{"$f":"IFERROR(INDEX(Lots!$D:$D,=IFERROR(MATCH(3,Lots!$O:$O,0),\"\")),\"\")","v":null},{"$f":"IFERROR(INDEX(Lots!$L:$L,=IFERROR(MATCH(3,Lots!$O:$O,0),\"\")),\"\")","v":null},{"$f":"IFERROR(INDEX(Lots!$F:$F,=IFERROR(MATCH(3,Lots!$O:$O,0),\"\")),\"\")","v":null},{"$f":"IFERROR(INDEX(Lots!$H:$H,=IFERROR(MATCH(3,Lots!$O:$O,0),\"\")),\"\")","v":null},{"$f":"IFERROR(INDEX(Lots!$Q:$Q,=IFERROR(MATCH(3,Lots!$O:$O,0),\"\")),\"\")","v":null},{"$f":"IFERROR(INDEX(Lots!$I:$I,=IFERROR(MATCH(3,Lots!$O:$O,0),\"\")),\"\")","v":null},{"$f":"IFERROR(INDEX(Lots!$J:$J,=IFERROR(MATCH(3,Lots!$O:$O,0),\"\")),\"\")","v":null},{"$f":"IFERROR($I9*$G9,\"\")","v":null}]
[4,{"$f":"IFERROR(INDEX(Lots!$C:$C,=IFERROR(MATCH(4,Lots!$O:$O,0),\"\")),\"\")","v":null},{"$f":"IFERROR(INDEX(Lots!$D:$D,=IFERROR(MATCH(4,Lots!$O:$O,0),\"\")),\"\")","v":null},{"$f":"IFERROR(INDEX(Lots!$L:$L,=IFERROR(MATCH(4,Lots!$O:$O,0),\"\")),\"\")","v":null},{"$f":"IFERROR(INDEX(Lots!$F:$F,=IFERROR(MATCH(4,Lots!$O:$O,0),\"\")),\"\")","v":null},{"$f":"IFERROR(INDEX(Lots!$H:$H,=IFERROR(MATCH(4,Lots!$O:$O,0),\"\")),\"\")","v":null},{"$f":"IFERROR(INDEX(Lots!$Q:$Q,=IFERROR(MATCH(4,Lots!$O:$O,0),\"\")),\"\")","v":null},{"$f":"IFERROR(INDEX(Lots!$I:$I,=IFERROR(MATCH(4,Lots!$O:$O,0),\"\")),\"\")","v":null},{"$f":"IFERROR(INDEX(Lots!$J:$J,=IFERROR(MATCH(4,Lots!$O:$O,0),\"\")),\"\")","v":null},{"$f":"IFERROR($I10*$G10,\"\")","v":null}]
[5,{"$f":"IFERROR(INDEX(Lots!$C:$C,=IFERROR(MATCH(5,Lots!$O:$O,0),\"\")),\"\")","v":null},{"$f":"IFERROR(INDEX(Lots!$D:$D,=IFERROR(MATCH(5,Lots!$O:$O,0),\"\")),\"\")","v":null},{"$f":"IFERROR(INDEX(Lots!$L:$L,=IFERROR(MATCH(5,Lots!$O:$O,0),\"\")),\"\")","v":null},{"$f":"IFERROR(INDEX(Lots!$F:$F,=IFERROR(MATCH(5,Lots!$O:$O,0),\"\")),\"\")","v":null},{"$f":"IFERROR(INDEX(Lots!$H:$H,=IFERROR(MATCH(5,Lots!$O:$O,0),\"\")),\"\")","v":null},{"$f":"IFERROR(INDEX(Lots!$Q:$Q,=IFERROR(MATCH(5,Lots!$O:$O,0),\"\")),\"\")","v":null},{"$f":"IFERROR(INDEX(Lots!$I:$I,=IFERROR(MATCH(5,Lots!$O:$O,0),\"\")),\"\")","v":null},{"$f":"IFERROR(INDEX(Lots!$J:$J,=IFERROR(MATCH(5,Lots!$O:$O,0),\"\")),\"\")","v":null},{"$f":"IFERROR($I11*$G11,\"\")","v":null}]
[6,{"$f":"IFERROR(INDEX(Lots!$C:$C,=IFERROR(MATCH(6,Lots!$O:$O,0),\"\")),\"\")","v":null},{"$f":"IFERROR(INDEX(Lots!$D:$D,=IFERROR(MATCH(6,Lots!$O:$O,0),\"\")),\"\")","v":null},{"$f":"IFERROR(INDEX(Lots!$L:$L,=IFERROR(MATCH(6,Lots!$O:$O,0),\"\")),\"\")","v":null},{"$f":"IFERROR(INDEX(Lots!$F:$F,=IFERROR(MATCH(6,Lots!$O:$O,0),\"\")),\"\")","v":null},{"$f":"IFERROR(INDEX(Lots!$H:$H,=IFERROR(MATCH(6,Lots!$O:$O,0),\"\")),\"\")","v":null},{"$f":"IFERROR(INDEX(Lots!$Q:$Q,=IFERROR(MATCH(6,Lots!$O:$O,0),\"\")),\"\")","v":null},{"$f":"IFERROR(INDEX(Lots!$I:$I,=IFERROR(MATCH(6,Lots!$O:$O,0),\"\")),\"\")","v":null},{"$f":"IFERROR(INDEX(Lots!$J:$J,=IFERROR(MATCH(6,Lots!$O:$O,0),\"\")),\"\")","v":null},{"$f":"IFERROR($I12*$G12,\"\")","v":null}]
[7,{"$f":"IFERROR(INDEX(Lots!$C:$C,=IFERROR(MATCH(7,Lots!$O:$O,0),\"\")),\"\")","v":null},{"$f":"IFERROR(INDEX(Lots!$D:$D,=IFERROR(MATCH(7,Lots!$O:$O,0),\"\")),\"\")","v":null},{"$f":"IFERROR(INDEX(Lots!$L:$L,=IFERROR(MATCH(7,Lots!$O:$O,0),\"\")),\"\")","v":null},{"$f":"IFERROR(INDEX(Lots!$F:$F,=IFERROR(MATCH(7,Lots!$O:$O,0),\"\")),\"\")","v":null},{"$f":"IFERROR(INDEX(Lots!$H:$H,=IFERROR(MATCH(7,Lots!$O:$O,0),\"\")),\"\")","v":null},{"$f":"IFERROR(INDEX(Lots!$Q:$Q,=IFERROR(MATCH(7,Lots!$O:$O,0),\"\")),\"\")","v":null},{"$f":"IFERROR(INDEX(Lots!$I:$I,=IFERROR(MATCH(7,Lots!$O:$O,0),\"\")),\"\")","v":null},{"$f":"IFERROR(INDEX(Lots!$J:$J,=IFERROR(MATCH(7,Lots!$O:$O,0),\"\")),\"\")","v":null},{"$f":"IFERROR($I13*$G13,\"\")","v":null}]
[8,{"$f":"IFERROR(INDEX(Lots!$C:$C,=IFERROR(MATCH(8,Lots!$O:$O,0),\"\")),\"\")","v":null},{"$f":"IFERROR(INDEX(Lots!$D:$D,=IFERROR(MATCH(8,Lots!$O:$O,0),\"\")),\"\")","v":null},{"$f":"IFERROR(INDEX(Lots!$L:$L,=IFERROR(MATCH(8,Lots!$O:$O,0),\"\")),\"\")","v":null},{"$f":"IFERROR(INDEX(Lots!$F:$F,=IFERROR(MATCH(8,Lots!$O:$O,0),\"\")),\"\")","v":null},{"$f":"IFERROR(INDEX(Lots!$H:$H,=IFERROR(MATCH(8,Lots!$O:$O,0),\"\")),\"\")","v":null},{"$f":"IFERROR(INDEX(Lots!$Q:$Q,=IFERROR(MATCH(8,Lots!$O:$O,0),\"\")),\"\")","v":null},{"$f":"IFERROR(INDEX(Lots!$I:$I,=IFERROR(MATCH(8,Lots!$O:$O,0),\"\")),\"\")","v":null},{"$f":"IFERROR(INDEX(Lots!$J:$J,=IFERROR(MATCH(8,Lots!$O:$O,0),\"\")),\"\")","v":null},{"$f":"IFERROR($I14*$G14,\"\")","v":null}]
[9,{"$f":"IFERROR(INDEX(Lots!$C:$C,=IFERROR(MATCH(9,Lots!$O:$O,0),\"\")),\"\")","v":null},{"$f":"IFERROR(INDEX(Lots!$D:$D,=IFERROR(MATCH(9,Lots!$O:$O,0),\"\")),\"\")","v":null},{"$f":"IFERROR(INDEX(Lots!$L:$L,=IFERROR(MATCH(9,Lots!$O:$O,0),\"\")),\"\")","v":null},{"$f":"IFERROR(INDEX(Lots!$F:$F,=IFERROR(MATCH(9,Lots!$O:$O,0),\"\")),\"\")","v":null},{"$f":"IFERROR(INDEX(Lots!$H:$H,=IFERROR(MATCH(9,Lots!$O:$O,0),\"\")),\"\")","v":null},{"$f":"IFERROR(INDEX(Lots!$Q:$Q,=IFERROR(MATCH(9,Lots!$O:$O,0),\"\")),\"\")","v":null},{"$f":"IFERROR(INDEX(Lots!$I:$I,=IFERROR(MATCH(9,Lots!$O:$O,0),\"\")),\"\")","v":null},{"$f":"IFERROR(INDEX(Lots!$J:$J,=IFERROR(MATCH(9,Lots!$O:$O,0),\"\")),\"\")","v":null},{"$f":"IFERROR($I15*$G15,\"\")","v":null}]
[10,{"$f":"IFERROR(INDEX(Lots!$C:$C,=IFERROR(MATCH(10,Lots!$O:$O,0),\"\")),\"\")","v":null},{"$f":"IFERROR(INDEX(Lots!$D:$D,=IFERROR(MATCH(10,Lots!$O:$O,0),\"\")),\"\")","v":null},{"$f":"IFERROR(INDEX(Lots!$L:$L,=IFERROR(MATCH(10,Lots!$O:$O,0),\"\")),\"\")","v":null},{"$f":"IFERROR(INDEX(Lots!$F:$F,=IFERROR(MATCH(10,Lots!$O:$O,0),\"\")),\"\")","v":null},{"$f":"IFERROR(INDEX(Lots!$H:$H,=IFERROR(MATCH(10,Lots!$O:$O,0),\"\")),\"\")","v":null},{"$f":"IFERROR(INDEX(Lots!$Q:$Q,=IFERROR(MATCH(10,Lots!$O:$O,0),\"\")),\"\")","v":null},{"$f":"IFERROR(INDEX(Lots!$I:$I,=IFERROR(MATCH(10,Lots!$O:$O,0),\"\")),\"\")","v":null},{"$f":"IFERROR(INDEX(Lots!$J:$J,=IFERROR(MATCH(10,Lots!$O:$O,0),\"\")),\"\")","v":null},{"$f":"IFERROR($I16*$G16,\"\")","v":null}]
[11,{"$f":"IFERROR(INDEX(Lots!$C:$C,=IFERROR(MATCH(11,Lots!$O:$O,0),\"\")),\"\")","v":null},{"$f":"IFERROR(INDEX(Lots!$D:$D,=IFERROR(MATCH(11,Lots!$O:$O,0),\"\")),\"\")","v":null},{"$f":"IFERROR(INDEX(Lots!$L:$L,=IFERROR(MATCH(11,Lots!$O:$O,0),\"\")),\"\")","v":null},{"$f":"IFERROR(INDEX(Lots!$F:$F,=IFERROR(MATCH(11,Lots!$O:$O,0),\"\")),\"\")","v":null},{"$f":"IFERROR(INDEX(Lots!$H:$H,=IFERROR(MATCH(11,Lots!$O:$O,0),\"\")),\"\")","v":null},{"$f":"IFERROR(INDEX(Lots!$Q:$Q,=IFERROR(MATCH(11,Lots!$O:$O,0),\"\")),\"\")","v":null},{"$f":"IFERROR(INDEX(Lots!$I:$I,=IFERROR(MATCH(11,Lots!$O:$O,0),\"\")),\"\")","v":null},{"$f":"IFERROR(INDEX(Lots!$J:$J,=IFERROR(MATCH(11,Lots!$O:$O,0),\"\")),\"\")","v":null},{"$f":"IFERROR($I17*$G17,\"\")","v":null}]
[12,{"$f":"IFERROR(INDEX(Lots!$C:$C,=IFERROR(MATCH(12,Lots!$O:$O,0),\"\")),\"\")","v":null},{"$f":"IFERROR(INDEX(Lots!$D:$D,=IFERROR(MATCH(12,Lots!$O:$O,0),\"\")),\"\")","v":null},{"$f":"IFERROR(INDEX(Lots!$L:$L,=IFERROR(MATCH(12,Lots!$O:$O,0),\"\")),\"\")","v":null},{"$f":"IFERROR(INDEX(Lots!$F:$F,=IFERROR(MATCH(12,Lots!$O:$O,0),\"\")),\"\")","v":null},{"$f":"IFERROR(INDEX(Lots!$H:$H,=IFERROR(MATCH(12,Lots!$O:$O,0),\"\")),\"\")","v":null},{"$f":"IFERROR(INDEX(Lots!$Q:$Q,=IFERROR(MATCH(12,Lots!$O:$O,0),\"\")),\"\")","v":null},{"$f":"IFERROR(INDEX(Lots!$I:$I,=IFERROR(MATCH(12,Lots!$O:$O,0),\"\")),\"\")","v":null},{"$f":"IFERROR(INDEX(Lots!$J:$J,=IFERROR(MATCH(12,Lots!$O:$O,0),\"\")),\"\")","v":null},{"$f":"IFERROR($I18*$G18,\"\")","v":null}]
[13,{"$f":"IFERROR(INDEX(Lots!$C:$C,=IFERROR(MATCH(13,Lots!$O:$O,0),\"\")),\"\")","v":null},{"$f":"IFERROR(INDEX(Lots!$D:$D,=IFERROR(MATCH(13,Lots!$O:$O,0),\"\")),\"\")","v":null},{"$f":"IFERROR(INDEX(Lots!$L:$L,=IFERROR(MATCH(13,Lots!$O:$O,0),\"\")),\"\")","v":null},{"$f":"IFERROR(INDEX(Lots!$F:$F,=IFERROR(MATCH(13,Lots!$O:$O,0),\"\")),\"\")","v":null},{"$f":"IFERROR(INDEX(Lots!$H:$H,=IFERROR(MATCH(13,Lots!$O:$O,0),\"\")),\"\")","v":null},{"$f":"IFERROR(INDEX(Lots!$Q:$Q,=IFERROR(MATCH(13,Lots!$O:$O,0),\"\")),\"\")","v":null},{"$f":"IFERROR(INDEX(Lots!$I:$I,=IFERROR(MATCH(13,Lots!$O:$O,0),\"\")),\"\")","v":null},{"$f":"IFERROR(INDEX(Lots!$J:$J,=IFERROR(MATCH(13,Lots!$O:$O,0),\"\")),\"\")","v":null},{"$f":"IFERROR($I19*$G19,\"\")","v":null}]
[14,{"$f":"IFERROR(INDEX(Lots!$C:$C,=IFERROR(MATCH(14,Lots!$O:$O,0),\"\")),\"\")","v":null},{"$f":"IFERROR(INDEX(Lots!$D:$D,=IFERROR(MATCH(14,Lots!$O:$O,0),\"\")),\"\")","v":null},{"$f":"IFERROR(INDEX(Lots!$L:$L,=IFERROR(MATCH(14,Lots!$O:$O,0),\"\")),\"\")","v":null},{"$f":"IFERROR(INDEX(Lots!$F:$F,=IFERROR(MATCH(14,Lots!$O:$O,0),\"\")),\"\")","v":null},{"$f":"IFERROR(INDEX(Lots!$H:$H,=IFERROR(MATCH(14,Lots!$O:$O,0),\"\")),\"\")","v":null},{"$f":"IFERROR(INDEX(Lots!$Q:$Q,=IFERROR(MATCH(14,Lots!$O:$O,0),\"\")),\"\")","v":null},{"$f":"IFERROR(INDEX(Lots!$I:$I,=IFERROR(MATCH(14,Lots!$O:$O,0),\"\")),\"\")","v":null},{"$f":"IFERROR(INDEX(Lots!$J:$J,=IFERROR(MATCH(14,Lots!$O:$O,0),\"\")),\"\")","v":null},{"$f":"IFERROR($I20*$G20,\"\")","v":null}]
{"$rows_left_out":9}