{"text_format":"3","workbook":"xlsx","n_sheets":4,"sheets":["Idées","Vote","Top causes","Dashboard"],"not_rendered":{"charts":2,"defined_names":3},"read":"whole","date_system":"1900"}

{"sheet":"Idées","index":0,"n_rows":1003,"n_cols":12,"rows_kept":1003,"merged":[[0,0,0,11],[1,1,1,11]]}
["Ishikawa — Matrice 6M (brainstorming & score)"]
["Aide & rappels","RPN = Gravite × Occurrence × Detectabilite   |   Score global = alpha*Norm(RPN) + (1-alpha)*Norm(VoteMoyen)"]
["ID","Famille (6M)","Cause","Preuves/Observations","Contre-mesure proposee","Proprietaire","Gravite (1-5)","Occurrence (1-5)","Detectabilite (1-5)","RPN (GxOxD)","Vote moyen","Score global"]
["C-001","Machine","Usure galet convoyeur","Bruit/echauffement anormal","Plan de maintenance + stock piece","Maintenance",4,3,3,{"$f":"IF(AND(G4>0,H4>0,I4>0),G4*H4*I4,\"\")","v":null},{"$f":"IFERROR(XLOOKUP(A4,Vote!G4#,Vote!I4#,0),0)","v":null},{"$f":"IF(J4=\"\",\"\",Alpha*(J4/MAX(IDEES[RPN (GxOxD)]))+(1-Alpha)*(K4/5))","v":null}]
["C-002","Methode","Procedure de demarrage floue","Incoherence entre postes","Standardiser & former","Production",3,4,3,{"$f":"IF(AND(G5>0,H5>0,I5>0),G5*H5*I5,\"\")","v":null},{"$f":"IFERROR(XLOOKUP(A5,Vote!G4#,Vote!I4#,0),0)","v":null},{"$f":"IF(J5=\"\",\"\",Alpha*(J5/MAX(IDEES[RPN (GxOxD)]))+(1-Alpha)*(K5/5))","v":null}]
["C-003","Matiere","Variabilite fournisseur","Taux rebut hausse lot #A12","Qualification fournisseur + IQC renforce","Achats",4,3,2,{"$f":"IF(AND(G6>0,H6>0,I6>0),G6*H6*I6,\"\")","v":null},{"$f":"IFERROR(XLOOKUP(A6,Vote!G4#,Vote!I4#,0),0)","v":null},{"$f":"IF(J6=\"\",\"\",Alpha*(J6/MAX(IDEES[RPN (GxOxD)]))+(1-Alpha)*(K6/5))","v":null}]
["C-004","Milieu","Eclairage insuffisant","Luxmetre < seuil zone A","Ajouter luminaires / maintenance","Services generaux",2,3,3,{"$f":"IF(AND(G7>0,H7>0,I7>0),G7*H7*I7,\"\")","v":null},{"$f":"IFERROR(XLOOKUP(A7,Vote!G4#,Vote!I4#,0),0)","v":null},{"$f":"IF(J7=\"\",\"\",Alpha*(J7/MAX(IDEES[RPN (GxOxD)]))+(1-Alpha)*(K7/5))","v":null}]
["C-005","Main-d'oeuvre","Poste non maitrise","Erreurs operateur nouveaux","Tutorat + check-list 1ere semaine","RH/Prod",3,4,3,{"$f":"IF(AND(G8>0,H8>0,I8>0),G8*H8*I8,\"\")","v":null},{"$f":"IFERROR(XLOOKUP(A8,Vote!G4#,Vote!I4#,0),0)","v":null},{"$f":"IF(J8=\"\",\"\",Alpha*(J8/MAX(IDEES[RPN (GxOxD)]))+(1-Alpha)*(K8/5))","v":null}]
["C-006","Mesure","Capteur non calibre","Derive mesure temperature","Plan etalon. + alarme derive","Qualite",3,3,4,{"$f":"IF(AND(G9>0,H9>0,I9>0),G9*H9*I9,\"\")","v":null},{"$f":"IFERROR(XLOOKUP(A9,Vote!G4#,Vote!I4#,0),0)","v":null},{"$f":"IF(J9=\"\",\"\",Alpha*(J9/MAX(IDEES[RPN (GxOxD)]))+(1-Alpha)*(K9/5))","v":null}]
["C-007","Methode","Changement de serie long","Temps perdus > 25%","SMED + 5S outillage","Production",4,3,3,{"$f":"IF(AND(G10>0,H10>0,I10>0),G10*H10*I10,\"\")","v":null},{"$f":"IFERROR(XLOOKUP(A10,Vote!G4#,Vote!I4#,0),0)","v":null},{"$f":"IF(J10=\"\",\"\",Alpha*(J10/MAX(IDEES[RPN (GxOxD)]))+(1-Alpha)*(K10/5))","v":null}]
["C-008","Milieu","Poussiere zone emballage","Colmatage filtres","Nettoyage planifie + filtre Merv","HSE",2,3,2,{"$f":"IF(AND(G11>0,H11>0,I11>0),G11*H11*I11,\"\")","v":null},{"$f":"IFERROR(XLOOKUP(A11,Vote!G4#,Vote!I4#,0),0)","v":null},{"$f":"IF(J11=\"\",\"\",Alpha*(J11/MAX(IDEES[RPN (GxOxD)]))+(1-Alpha)*(K11/5))","v":null}]
["C-009","Machine","Vibrations presse","Pieces hors cote","Equilibrage + fondations","Maintenance",5,2,3,{"$f":"IF(AND(G12>0,H12>0,I12>0),G12*H12*I12,\"\")","v":null},{"$f":"IFERROR(XLOOKUP(A12,Vote!G4#,Vote!I4#,0),0)","v":null},{"$f":"IF(J12=\"\",\"\",Alpha*(J12/MAX(IDEES[RPN (GxOxD)]))+(1-Alpha)*(K12/5))","v":null}]
["C-010","Matiere","Humidite carton","Deformation produit fini","Stock en zone seche + FIFO","Logistique",3,3,3,{"$f":"IF(AND(G13>0,H13>0,I13>0),G13*H13*I13,\"\")","v":null},{"$f":"IFERROR(XLOOKUP(A13,Vote!G4#,Vote!I4#,0),0)","v":null},{"$f":"IF(J13=\"\",\"\",Alpha*(J13/MAX(IDEES[RPN (GxOxD)]))+(1-Alpha)*(K13/5))","v":null}]
["C-011","Main-d'oeuvre","Rotation poste insuffisante","Fatigue en fin de poste","Rotation hebdo + polyvalence","Production",2,3,3]
["C-012","Methode","Documentation obsolète","Versionnage non maîtrisé","Gestion doc. + QR codes poste","Qualite",3,2,3]
["C-013","Mesure","Seuils d’alarme mal réglés","Faux positifs fréquents","Recalibrage + hystérésis","Maintenance",2,3,4]
["C-014","Milieu","Température variable","Impact collage/peinture","Contrôle HVAC + enregistreurs","HSE",3,2,3]
["C-015","Machine","Lubrification aléatoire","Usure prématurée","PLM + graisseurs auto","Maintenance",3,3,3]
["C-016","Matiere","Lot matière mixé","Traçabilité compromise","Kanban + interdiction mélange","Logistique",4,2,3]
["C-017","Main-d'oeuvre","Brief manquant en relève","Perte d’information","Standard de passation + check","Production",2,3,3]
["C-018","Methode","Nettoyage non standard","Résidus en machine","Standard 5S + audit visuel","Production",3,3,2]
["C-019","Mesure","Balance non vérifiée","Poids hors tolérances","Vérif. périodique + étiq.","Qualite",3,3,3]
["C-020","Milieu","Bruit élevé","Erreurs et fatigue","Capotage + EPI + rotation","HSE",3,3,3]
[{"$nulls":9},{"$f":"IF(AND(G24>0,H24>0,I24>0),G24*H24*I24,\"\")","v":null},{"$f":"IFERROR(XLOOKUP(A24,Vote!G4#,Vote!I4#,0),0)","v":null},{"$f":"IF(J24=\"\",\"\",Alpha*(J24/MAX(IDEES[RPN (GxOxD)]))+(1-Alpha)*(K24/5))","v":null}]
[{"$nulls":9},{"$f":"IF(AND(G25>0,H25>0,I25>0),G25*H25*I25,\"\")","v":null},{"$f":"IFERROR(XLOOKUP(A25,Vote!G4#,Vote!I4#,0),0)","v":null},{"$f":"IF(J25=\"\",\"\",Alpha*(J25/MAX(IDEES[RPN (GxOxD)]))+(1-Alpha)*(K25/5))","v":null}]
[{"$nulls":9},{"$f":"IF(AND(G26>0,H26>0,I26>0),G26*H26*I26,\"\")","v":null},{"$f":"IFERROR(XLOOKUP(A26,Vote!G4#,Vote!I4#,0),0)","v":null},{"$f":"IF(J26=\"\",\"\",Alpha*(J26/MAX(IDEES[RPN (GxOxD)]))+(1-Alpha)*(K26/5))","v":null}]
[{"$nulls":9},{"$f":"IF(AND(G27>0,H27>0,I27>0),G27*H27*I27,\"\")","v":null},{"$f":"IFERROR(XLOOKUP(A27,Vote!G4#,Vote!I4#,0),0)","v":null},{"$f":"IF(J27=\"\",\"\",Alpha*(J27/MAX(IDEES[RPN (GxOxD)]))+(1-Alpha)*(K27/5))","v":null}]
[{"$nulls":9},{"$f":"IF(AND(G28>0,H28>0,I28>0),G28*H28*I28,\"\")","v":null},{"$f":"IFERROR(XLOOKUP(A28,Vote!G4#,Vote!I4#,0),0)","v":null},{"$f":"IF(J28=\"\",\"\",Alpha*(J28/MAX(IDEES[RPN (GxOxD)]))+(1-Alpha)*(K28/5))","v":null}]
[{"$nulls":9},{"$f":"IF(AND(G29>0,H29>0,I29>0),G29*H29*I29,\"\")","v":null},{"$f":"IFERROR(XLOOKUP(A29,Vote!G4#,Vote!I4#,0),0)","v":null},{"$f":"IF(J29=\"\",\"\",Alpha*(J29/MAX(IDEES[RPN (GxOxD)]))+(1-Alpha)*(K29/5))","v":null}]
[{"$nulls":9},{"$f":"IF(AND(G30>0,H30>0,I30>0),G30*H30*I30,\"\")","v":null},{"$f":"IFERROR(XLOOKUP(A30,Vote!G4#,Vote!I4#,0),0)","v":null},{"$f":"IF(J30=\"\",\"\",Alpha*(J30/MAX(IDEES[RPN (GxOxD)]))+(1-Alpha)*(K30/5))","v":null}]
[{"$nulls":9},{"$f":"IF(AND(G31>0,H31>0,I31>0),G31*H31*I31,\"\")","v":null},{"$f":"IFERROR(XLOOKUP(A31,Vote!G4#,Vote!I4#,0),0)","v":null},{"$f":"IF(J31=\"\",\"\",Alpha*(J31/MAX(IDEES[RPN (GxOxD)]))+(1-Alpha)*(K31/5))","v":null}]
[{"$nulls":9},{"$f":"IF(AND(G32>0,H32>0,I32>0),G32*H32*I32,\"\")","v":null},{"$f":"IFERROR(XLOOKUP(A32,Vote!G4#,Vote!I4#,0),0)","v":null},{"$f":"IF(J32=\"\",\"\",Alpha*(J32/MAX(IDEES[RPN (GxOxD)]))+(1-Alpha)*(K32/5))","v":null}]
[{"$nulls":9},{"$f":"IF(AND(G33>0,H33>0,I33>0),G33*H33*I33,\"\")","v":null},{"$f":"IFERROR(XLOOKUP(A33,Vote!G4#,Vote!I4#,0),0)","v":null},{"$f":"IF(J33=\"\",\"\",Alpha*(J33/MAX(IDEES[RPN (GxOxD)]))+(1-Alpha)*(K33/5))","v":null}]
[{"$nulls":9},{"$f":"IF(AND(G34>0,H34>0,I34>0),G34*H34*I34,\"\")","v":null},{"$f":"IFERROR(XLOOKUP(A34,Vote!G4#,Vote!I4#,0),0)","v":null},{"$f":"IF(J34=\"\",\"\",Alpha*(J34/MAX(IDEES[RPN (GxOxD)]))+(1-Alpha)*(K34/5))","v":null}]
[{"$nulls":9},{"$f":"IF(AND(G35>0,H35>0,I35>0),G35*H35*I35,\"\")","v":null},{"$f":"IFERROR(XLOOKUP(A35,Vote!G4#,Vote!I4#,0),0)","v":null},{"$f":"IF(J35=\"\",\"\",Alpha*(J35/MAX(IDEES[RPN (GxOxD)]))+(1-Alpha)*(K35/5))","v":null}]
[{"$nulls":9},{"$f":"IF(AND(G36>0,H36>0,I36>0),G36*H36*I36,\"\")","v":null},{"$f":"IFERROR(XLOOKUP(A36,Vote!G4#,Vote!I4#,0),0)","v":null},{"$f":"IF(J36=\"\",\"\",Alpha*(J36/MAX(IDEES[RPN (GxOxD)]))+(1-Alpha)*(K36/5))","v":null}]
[{"$nulls":9},{"$f":"IF(AND(G37>0,H37>0,I37>0),G37*H37*I37,\"\")","v":null},{"$f":"IFERROR(XLOOKUP(A37,Vote!G4#,Vote!I4#,0),0)","v":null},{"$f":"IF(J37=\"\",\"\",Alpha*(J37/MAX(IDEES[RPN (GxOxD)]))+(1-Alpha)*(K37/5))","v":null}]
[{"$nulls":9},{"$f":"IF(AND(G38>0,H38>0,I38>0),G38*H38*I38,\"\")","v":null},{"$f":"IFERROR(XLOOKUP(A38,Vote!G4#,Vote!I4#,0),0)","v":null},{"$f":"IF(J38=\"\",\"\",Alpha*(J38/MAX(IDEES[RPN (GxOxD)]))+(1-Alpha)*(K38/5))","v":null}]
[{"$nulls":9},{"$f":"IF(AND(G39>0,H39>0,I39>0),G39*H39*I39,\"\")","v":null},{"$f":"IFERROR(XLOOKUP(A39,Vote!G4#,Vote!I4#,0),0)","v":null},{"$f":"IF(J39=\"\",\"\",Alpha*(J39/MAX(IDEES[RPN (GxOxD)]))+(1-Alpha)*(K39/5))","v":null}]
[{"$nulls":9},{"$f":"IF(AND(G40>0,H40>0,I40>0),G40*H40*I40,\"\")","v":null},{"$f":"IFERROR(XLOOKUP(A40,Vote!G4#,Vote!I4#,0),0)","v":null},{"$f":"IF(J40=\"\",\"\",Alpha*(J40/MAX(IDEES[RPN (GxOxD)]))+(1-Alpha)*(K40/5))","v":null}]
[{"$nulls":9},{"$f":"IF(AND(G41>0,H41>0,I41>0),G41*H41*I41,\"\")","v":null},{"$f":"IFERROR(XLOOKUP(A41,Vote!G4#,Vote!I4#,0),0)","v":null},{"$f":"IF(J41=\"\",\"\",Alpha*(J41/MAX(IDEES[RPN (GxOxD)]))+(1-Alpha)*(K41/5))","v":null}]
[{"$nulls":9},{"$f":"IF(AND(G42>0,H42>0,I42>0),G42*H42*I42,\"\")","v":null},{"$f":"IFERROR(XLOOKUP(A42,Vote!G4#,Vote!I4#,0),0)","v":null},{"$f":"IF(J42=\"\",\"\",Alpha*(J42/MAX(IDEES[RPN (GxOxD)]))+(1-Alpha)*(K42/5))","v":null}]
[{"$nulls":9},{"$f":"IF(AND(G43>0,H43>0,I43>0),G43*H43*I43,\"\")","v":null},{"$f":"IFERROR(XLOOKUP(A43,Vote!G4#,Vote!I4#,0),0)","v":null},{"$f":"IF(J43=\"\",\"\",Alpha*(J43/MAX(IDEES[RPN (GxOxD)]))+(1-Alpha)*(K43/5))","v":null}]
[{"$nulls":9},{"$f":"IF(AND(G44>0,H44>0,I44>0),G44*H44*I44,\"\")","v":null},{"$f":"IFERROR(XLOOKUP(A44,Vote!G4#,Vote!I4#,0),0)","v":null},{"$f":"IF(J44=\"\",\"\",Alpha*(J44/MAX(IDEES[RPN (GxOxD)]))+(1-Alpha)*(K44/5))","v":null}]
[{"$nulls":9},{"$f":"IF(AND(G45>0,H45>0,I45>0),G45*H45*I45,\"\")","v":null},{"$f":"IFERROR(XLOOKUP(A45,Vote!G4#,Vote!I4#,0),0)","v":null},{"$f":"IF(J45=\"\",\"\",Alpha*(J45/MAX(IDEES[RPN (GxOxD)]))+(1-Alpha)*(K45/5))","v":null}]
[{"$nulls":9},{"$f":"IF(AND(G46>0,H46>0,I46>0),G46*H46*I46,\"\")","v":null},{"$f":"IFERROR(XLOOKUP(A46,Vote!G4#,Vote!I4#,0),0)","v":null},{"$f":"IF(J46=\"\",\"\",Alpha*(J46/MAX(IDEES[RPN (GxOxD)]))+(1-Alpha)*(K46/5))","v":null}]
[{"$nulls":9},{"$f":"IF(AND(G47>0,H47>0,I47>0),G47*H47*I47,\"\")","v":null},{"$f":"IFERROR(XLOOKUP(A47,Vote!G4#,Vote!I4#,0),0)","v":null},{"$f":"IF(J47=\"\",\"\",Alpha*(J47/MAX(IDEES[RPN (GxOxD)]))+(1-Alpha)*(K47/5))","v":null}]
[{"$nulls":9},{"$f":"IF(AND(G48>0,H48>0,I48>0),G48*H48*I48,\"\")","v":null},{"$f":"IFERROR(XLOOKUP(A48,Vote!G4#,Vote!I4#,0),0)","v":null},{"$f":"IF(J48=\"\",\"\",Alpha*(J48/MAX(IDEES[RPN (GxOxD)]))+(1-Alpha)*(K48/5))","v":null}]
[{"$nulls":9},{"$f":"IF(AND(G49>0,H49>0,I49>0),G49*H49*I49,\"\")","v":null},{"$f":"IFERROR(XLOOKUP(A49,Vote!G4#,Vote!I4#,0),0)","v":null},{"$f":"IF(J49=\"\",\"\",Alpha*(J49/MAX(IDEES[RPN (GxOxD)]))+(1-Alpha)*(K49/5))","v":null}]
[{"$nulls":9},{"$f":"IF(AND(G50>0,H50>0,I50>0),G50*H50*I50,\"\")","v":null},{"$f":"IFERROR(XLOOKUP(A50,Vote!G4#,Vote!I4#,0),0)","v":null},{"$f":"IF(J50=\"\",\"\",Alpha*(J50/MAX(IDEES[RPN (GxOxD)]))+(1-Alpha)*(K50/5))","v":null}]
[{"$nulls":9},{"$f":"IF(AND(G51>0,H51>0,I51>0),G51*H51*I51,\"\")","v":null},{"$f":"IFERROR(XLOOKUP(A51,Vote!G4#,Vote!I4#,0),0)","v":null},{"$f":"IF(J51=\"\",\"\",Alpha*(J51/MAX(IDEES[RPN (GxOxD)]))+(1-Alpha)*(K51/5))","v":null}]
[{"$nulls":9},{"$f":"IF(AND(G52>0,H52>0,I52>0),G52*H52*I52,\"\")","v":null},{"$f":"IFERROR(XLOOKUP(A52,Vote!G4#,Vote!I4#,0),0)","v":null},{"$f":"IF(J52=\"\",\"\",Alpha*(J52/MAX(IDEES[RPN (GxOxD)]))+(1-Alpha)*(K52/5))","v":null}]
[{"$nulls":9},{"$f":"IF(AND(G53>0,H53>0,I53>0),G53*H53*I53,\"\")","v":null},{"$f":"IFERROR(XLOOKUP(A53,Vote!G4#,Vote!I4#,0),0)","v":null},{"$f":"IF(J53=\"\",\"\",Alpha*(J53/MAX(IDEES[RPN (GxOxD)]))+(1-Alpha)*(K53/5))","v":null}]
[{"$nulls":9},{"$f":"IF(AND(G54>0,H54>0,I54>0),G54*H54*I54,\"\")","v":null},{"$f":"IFERROR(XLOOKUP(A54,Vote!G4#,Vote!I4#,0),0)","v":null},{"$f":"IF(J54=\"\",\"\",Alpha*(J54/MAX(IDEES[RPN (GxOxD)]))+(1-Alpha)*(K54/5))","v":null}]
[{"$nulls":9},{"$f":"IF(AND(G55>0,H55>0,I55>0),G55*H55*I55,\"\")","v":null},{"$f":"IFERROR(XLOOKUP(A55,Vote!G4#,Vote!I4#,0),0)","v":null},{"$f":"IF(J55=\"\",\"\",Alpha*(J55/MAX(IDEES[RPN (GxOxD)]))+(1-Alpha)*(K55/5))","v":null}]
[{"$nulls":9},{"$f":"IF(AND(G56>0,H56>0,I56>0),G56*H56*I56,\"\")","v":null},{"$f":"IFERROR(XLOOKUP(A56,Vote!G4#,Vote!I4#,0),0)","v":null},{"$f":"IF(J56=\"\",\"\",Alpha*(J56/MAX(IDEES[RPN (GxOxD)]))+(1-Alpha)*(K56/5))","v":null}]
[{"$nulls":9},{"$f":"IF(AND(G57>0,H57>0,I57>0),G57*H57*I57,\"\")","v":null},{"$f":"IFERROR(XLOOKUP(A57,Vote!G4#,Vote!I4#,0),0)","v":null},{"$f":"IF(J57=\"\",\"\",Alpha*(J57/MAX(IDEES[RPN (GxOxD)]))+(1-Alpha)*(K57/5))","v":null}]
[{"$nulls":9},{"$f":"IF(AND(G58>0,H58>0,I58>0),G58*H58*I58,\"\")","v":null},{"$f":"IFERROR(XLOOKUP(A58,Vote!G4#,Vote!I4#,0),0)","v":null},{"$f":"IF(J58=\"\",\"\",Alpha*(J58/MAX(IDEES[RPN (GxOxD)]))+(1-Alpha)*(K58/5))","v":null}]
[{"$nulls":9},{"$f":"IF(AND(G59>0,H59>0,I59>0),G59*H59*I59,\"\")","v":null},{"$f":"IFERROR(XLOOKUP(A59,Vote!G4#,Vote!I4#,0),0)","v":null},{"$f":"IF(J59=\"\",\"\",Alpha*(J59/MAX(IDEES[RPN (GxOxD)]))+(1-Alpha)*(K59/5))","v":null}]
[{"$nulls":9},{"$f":"IF(AND(G60>0,H60>0,I60>0),G60*H60*I60,\"\")","v":null},{"$f":"IFERROR(XLOOKUP(A60,Vote!G4#,Vote!I4#,0),0)","v":null},{"$f":"IF(J60=\"\",\"\",Alpha*(J60/MAX(IDEES[RPN (GxOxD)]))+(1-Alpha)*(K60/5))","v":null}]
[{"$nulls":9},{"$f":"IF(AND(G61>0,H61>0,I61>0),G61*H61*I61,\"\")","v":null},{"$f":"IFERROR(XLOOKUP(A61,Vote!G4#,Vote!I4#,0),0)","v":null},{"$f":"IF(J61=\"\",\"\",Alpha*(J61/MAX(IDEES[RPN (GxOxD)]))+(1-Alpha)*(K61/5))","v":null}]
[{"$nulls":9},{"$f":"IF(AND(G62>0,H62>0,I62>0),G62*H62*I62,\"\")","v":null},{"$f":"IFERROR(XLOOKUP(A62,Vote!G4#,Vote!I4#,0),0)","v":null},{"$f":"IF(J62=\"\",\"\",Alpha*(J62/MAX(IDEES[RPN (GxOxD)]))+(1-Alpha)*(K62/5))","v":null}]
[{"$nulls":9},{"$f":"IF(AND(G63>0,H63>0,I63>0),G63*H63*I63,\"\")","v":null},{"$f":"IFERROR(XLOOKUP(A63,Vote!G4#,Vote!I4#,0),0)","v":null},{"$f":"IF(J63=\"\",\"\",Alpha*(J63/MAX(IDEES[RPN (GxOxD)]))+(1-Alpha)*(K63/5))","v":null}]
[{"$nulls":9},{"$f":"IF(AND(G64>0,H64>0,I64>0),G64*H64*I64,\"\")","v":null},{"$f":"IFERROR(XLOOKUP(A64,Vote!G4#,Vote!I4#,0),0)","v":null},{"$f":"IF(J64=\"\",\"\",Alpha*(J64/MAX(IDEES[RPN (GxOxD)]))+(1-Alpha)*(K64/5))","v":null}]
[{"$nulls":9},{"$f":"IF(AND(G65>0,H65>0,I65>0),G65*H65*I65,\"\")","v":null},{"$f":"IFERROR(XLOOKUP(A65,Vote!G4#,Vote!I4#,0),0)","v":null},{"$f":"IF(J65=\"\",\"\",Alpha*(J65/MAX(IDEES[RPN (GxOxD)]))+(1-Alpha)*(K65/5))","v":null}]
[{"$nulls":9},{"$f":"IF(AND(G66>0,H66>0,I66>0),G66*H66*I66,\"\")","v":null},{"$f":"IFERROR(XLOOKUP(A66,Vote!G4#,Vote!I4#,0),0)","v":null},{"$f":"IF(J66=\"\",\"\",Alpha*(J66/MAX(IDEES[RPN (GxOxD)]))+(1-Alpha)*(K66/5))","v":null}]
[{"$nulls":9},{"$f":"IF(AND(G67>0,H67>0,I67>0),G67*H67*I67,\"\")","v":null},{"$f":"IFERROR(XLOOKUP(A67,Vote!G4#,Vote!I4#,0),0)","v":null},{"$f":"IF(J67=\"\",\"\",Alpha*(J67/MAX(IDEES[RPN (GxOxD)]))+(1-Alpha)*(K67/5))","v":null}]
[{"$nulls":9},{"$f":"IF(AND(G68>0,H68>0,I68>0),G68*H68*I68,\"\")","v":null},{"$f":"IFERROR(XLOOKUP(A68,Vote!G4#,Vote!I4#,0),0)","v":null},{"$f":"IF(J68=\"\",\"\",Alpha*(J68/MAX(IDEES[RPN (GxOxD)]))+(1-Alpha)*(K68/5))","v":null}]
[{"$nulls":9},{"$f":"IF(AND(G69>0,H69>0,I69>0),G69*H69*I69,\"\")","v":null},{"$f":"IFERROR(XLOOKUP(A69,Vote!G4#,Vote!I4#,0),0)","v":null},{"$f":"IF(J69=\"\",\"\",Alpha*(J69/MAX(IDEES[RPN (GxOxD)]))+(1-Alpha)*(K69/5))","v":null}]
[{"$nulls":9},{"$f":"IF(AND(G70>0,H70>0,I70>0),G70*H70*I70,\"\")","v":null},{"$f":"IFERROR(XLOOKUP(A70,Vote!G4#,Vote!I4#,0),0)","v":null},{"$f":"IF(J70=\"\",\"\",Alpha*(J70/MAX(IDEES[RPN (GxOxD)]))+(1-Alpha)*(K70/5))","v":null}]
[{"$nulls":9},{"$f":"IF(AND(G71>0,H71>0,I71>0),G71*H71*I71,\"\")","v":null},{"$f":"IFERROR(XLOOKUP(A71,Vote!G4#,Vote!I4#,0),0)","v":null},{"$f":"IF(J71=\"\",\"\",Alpha*(J71/MAX(IDEES[RPN (GxOxD)]))+(1-Alpha)*(K71/5))","v":null}]
[{"$nulls":9},{"$f":"IF(AND(G72>0,H72>0,I72>0),G72*H72*I72,\"\")","v":null},{"$f":"IFERROR(XLOOKUP(A72,Vote!G4#,Vote!I4#,0),0)","v":null},{"$f":"IF(J72=\"\",\"\",Alpha*(J72/MAX(IDEES[RPN (GxOxD)]))+(1-Alpha)*(K72/5))","v":null}]
[{"$nulls":9},{"$f":"IF(AND(G73>0,H73>0,I73>0),G73*H73*I73,\"\")","v":null},{"$f":"IFERROR(XLOOKUP(A73,Vote!G4#,Vote!I4#,0),0)","v":null},{"$f":"IF(J73=\"\",\"\",Alpha*(J73/MAX(IDEES[RPN (GxOxD)]))+(1-Alpha)*(K73/5))","v":null}]
[{"$nulls":9},{"$f":"IF(AND(G74>0,H74>0,I74>0),G74*H74*I74,\"\")","v":null},{"$f":"IFERROR(XLOOKUP(A74,Vote!G4#,Vote!I4#,0),0)","v":null},{"$f":"IF(J74=\"\",\"\",Alpha*(J74/MAX(IDEES[RPN (GxOxD)]))+(1-Alpha)*(K74/5))","v":null}]
[{"$nulls":9},{"$f":"IF(AND(G75>0,H75>0,I75>0),G75*H75*I75,\"\")","v":null},{"$f":"IFERROR(XLOOKUP(A75,Vote!G4#,Vote!I4#,0),0)","v":null},{"$f":"IF(J75=\"\",\"\",Alpha*(J75/MAX(IDEES[RPN (GxOxD)]))+(1-Alpha)*(K75/5))","v":null}]
[{"$nulls":9},{"$f":"IF(AND(G76>0,H76>0,I76>0),G76*H76*I76,\"\")","v":null},{"$f":"IFERROR(XLOOKUP(A76,Vote!G4#,Vote!I4#,0),0)","v":null},{"$f":"IF(J76=\"\",\"\",Alpha*(J76/MAX(IDEES[RPN (GxOxD)]))+(1-Alpha)*(K76/5))","v":null}]
[{"$nulls":9},{"$f":"IF(AND(G77>0,H77>0,I77>0),G77*H77*I77,\"\")","v":null},{"$f":"IFERROR(XLOOKUP(A77,Vote!G4#,Vote!I4#,0),0)","v":null},{"$f":"IF(J77=\"\",\"\",Alpha*(J77/MAX(IDEES[RPN (GxOxD)]))+(1-Alpha)*(K77/5))","v":null}]
[{"$nulls":9},{"$f":"IF(AND(G78>0,H78>0,I78>0),G78*H78*I78,\"\")","v":null},{"$f":"IFERROR(XLOOKUP(A78,Vote!G4#,Vote!I4#,0),0)","v":null},{"$f":"IF(J78=\"\",\"\",Alpha*(J78/MAX(IDEES[RPN (GxOxD)]))+(1-Alpha)*(K78/5))","v":null}]
[{"$nulls":9},{"$f":"IF(AND(G79>0,H79>0,I79>0),G79*H79*I79,\"\")","v":null},{"$f":"IFERROR(XLOOKUP(A79,Vote!G4#,Vote!I4#,0),0)","v":null},{"$f":"IF(J79=\"\",\"\",Alpha*(J79/MAX(IDEES[RPN (GxOxD)]))+(1-Alpha)*(K79/5))","v":null}]
[{"$nulls":9},{"$f":"IF(AND(G80>0,H80>0,I80>0),G80*H80*I80,\"\")","v":null},{"$f":"IFERROR(XLOOKUP(A80,Vote!G4#,Vote!I4#,0),0)","v":null},{"$f":"IF(J80=\"\",\"\",Alpha*(J80/MAX(IDEES[RPN (GxOxD)]))+(1-Alpha)*(K80/5))","v":null}]
{"$rows_left_out":924}
{"sheet":"Vote","index":1,"n_rows":20,"n_cols":10,"rows_kept":20,"merged":[[0,0,0,10],[1,0,1,7]]}
["Vote & ponderation — priorisation des causes"]
["Poids alpha (risque vs votes) → Score global = alpha*Norm(RPN) + (1-alpha)*Norm(VoteMoyen)",{"$nulls":7},"alpha",0.6]
["Votant","ID Cause","Note (1-5)","Commentaire",null,null,"ID Cause","Nb votes","Vote moyen","Points totaux"]
["Alice","C-007",5,"Chgt de serie impacte le flux",null,null,{"$f":"SORT(UNIQUE(VOTES[ID Cause]))","v":null},{"$f":"IF(G4=\"\",,COUNTIF(VOTES[ID Cause],G4#))","v":null},{"$f":"IF(G4=\"\",,IFERROR(ROUND(AVERAGEIF(VOTES[ID Cause],G4#,VOTES[Note (1-5)]),2),0))","v":null},{"$f":"IF(G4=\"\",,SUMIF(VOTES[ID Cause],G4#,VOTES[Note (1-5)]))","v":null}]
["Bob","C-003",4,"Defauts fournisseur recurrents"]
["Carla","C-009",5,"Risque qualite majeur"]
["David","C-006",3,"Calibrage perfectible"]
["Eva","C-005",4,"Formation critique pour nouveaux"]
["Alice","C-003",4,"Qualif fournisseur a renforcer"]
["Bob","C-007",5,"Gain SMED certain"]
["Fay","C-007",5,"SMED à prioriser"]
["Guy","C-009",5,"Impact qualité majeur"]
["Hugo","C-003",4,"Fournisseur critique"]
["Iris","C-012",4,"Docs à mettre à jour vite"]
["Jon","C-015",4,"Lubrification clé pour MTBF"]
["Kira","C-016",5,"Traçabilité à sécuriser"]
["Léo","C-018",4,"Nettoyage standard = moins de défauts"]
["Mia","C-019",4,"Balances à vérifier d’urgence"]
["Noa","C-011",3,"Polyvalence utile mais pas critique"]
["Oli","C-020",4,"Bruit : santé + qualité"]

{"sheet":"Top causes","index":2,"n_rows":5,"n_cols":6,"rows_kept":5,"merged":[[0,0,0,7]]}
["Top causes — tri par Score global"]
["Parametre Top N :",10]
[]
["ID","Famille (6M)","Cause","RPN","Vote moyen","Score global"]
[{"$f":"TAKE(SORT(CHOOSECOLS(IDEES[[ID]:[Score global]],1,2,3,10,11,12),6,-1),$B$2)","v":null}]

{"sheet":"Dashboard","index":3,"n_rows":21,"n_cols":2,"rows_kept":21,"merged":[[0,0,0,11]]}
["Ishikawa 6M — Dashboard (Histogrammes & Répartition)"]
[]
["Histogramme RPN (fréquences par classe)"]
["Classe","Fréquence"]
["0–20",{"$f":"COUNTIFS(IDEES[RPN (GxOxD)],\">=0\",IDEES[RPN (GxOxD)],\"<=20\")","v":null}]
["21–40",{"$f":"COUNTIFS(IDEES[RPN (GxOxD)],\">=21\",IDEES[RPN (GxOxD)],\"<=40\")","v":null}]
["41–60",{"$f":"COUNTIFS(IDEES[RPN (GxOxD)],\">=41\",IDEES[RPN (GxOxD)],\"<=60\")","v":null}]
["61–80",{"$f":"COUNTIFS(IDEES[RPN (GxOxD)],\">=61\",IDEES[RPN (GxOxD)],\"<=80\")","v":null}]
["81–100",{"$f":"COUNTIFS(IDEES[RPN (GxOxD)],\">=81\",IDEES[RPN (GxOxD)],\"<=100\")","v":null}]
["101–125",{"$f":"COUNTIFS(IDEES[RPN (GxOxD)],\">=101\",IDEES[RPN (GxOxD)],\"<=125\")","v":null}]
[]
[]
[]
["Répartition par famille 6M"]
["Famille (6M)","Nombre"]
["Main-d'oeuvre",{"$f":"COUNTIF(IDEES[Famille (6M)],A16)","v":null}]
["Machine",{"$f":"COUNTIF(IDEES[Famille (6M)],A17)","v":null}]
["Matiere",{"$f":"COUNTIF(IDEES[Famille (6M)],A18)","v":null}]
["Methode",{"$f":"COUNTIF(IDEES[Famille (6M)],A19)","v":null}]
["Milieu",{"$f":"COUNTIF(IDEES[Famille (6M)],A20)","v":null}]
["Mesure",{"$f":"COUNTIF(IDEES[Famille (6M)],A21)","v":null}]